﻿"Item Id","Item URI","Dublin Core:Alternative Title","Dublin Core:Abstract","Dublin Core:Table Of Contents","Dublin Core:Date Available","Dublin Core:Date Created","Dublin Core:Date Accepted","Dublin Core:Date Copyrighted","Dublin Core:Date Submitted","Dublin Core:Date Issued","Dublin Core:Date Modified","Dublin Core:Date Valid","Dublin Core:Access Rights","Dublin Core:License","Dublin Core:Conforms To","Dublin Core:Has Format","Dublin Core:Has Part","Dublin Core:Has Version","Dublin Core:Is Format Of","Dublin Core:Is Part Of","Dublin Core:Is Referenced By","Dublin Core:Is Replaced By","Dublin Core:Is Required By","Dublin Core:Is Version Of","Dublin Core:References","Dublin Core:Replaces","Dublin Core:Requires","Dublin Core:Extent","Dublin Core:Medium","Dublin Core:Bibliographic Citation","Dublin Core:Spatial Coverage","Dublin Core:Temporal Coverage","Dublin Core:Accrual Method","Dublin Core:Accrual Periodicity","Dublin Core:Accrual Policy","Dublin Core:Audience","Dublin Core:Audience Education Level","Dublin Core:Mediator","Dublin Core:Instructional Method","Dublin Core:Provenance","Dublin Core:Rights Holder","Dublin Core:Title","Dublin Core:Subject","Dublin Core:Description","Dublin Core:Creator","Dublin Core:Source","Dublin Core:Publisher","Dublin Core:Date","Dublin Core:Contributor","Dublin Core:Rights","Dublin Core:Relation","Dublin Core:Format","Dublin Core:Language","Dublin Core:Type","Dublin Core:Identifier","Dublin Core:Coverage","Item Type Metadata:Text","Item Type Metadata:Interviewer","Item Type Metadata:Interviewee","Item Type Metadata:Location","Item Type Metadata:Transcription","Item Type Metadata:Local URL","Item Type Metadata:Original Format","Item Type Metadata:Physical Dimensions","Item Type Metadata:Duration","Item Type Metadata:Compression","Item Type Metadata:Producer","Item Type Metadata:Director","Item Type Metadata:Bit Rate/Frequency","Item Type Metadata:Time Summary","Item Type Metadata:Email Body","Item Type Metadata:Subject Line","Item Type Metadata:From","Item Type Metadata:To","Item Type Metadata:CC","Item Type Metadata:BCC","Item Type Metadata:Number of Attachments","Item Type Metadata:Standards","Item Type Metadata:Objectives","Item Type Metadata:Materials","Item Type Metadata:Lesson Plan Text","Item Type Metadata:URL","Item Type Metadata:Event Type","Item Type Metadata:Participants","Item Type Metadata:Birth Date","Item Type Metadata:Birthplace","Item Type Metadata:Death Date","Item Type Metadata:Occupation","Item Type Metadata:Biographical Text","Item Type Metadata:Bibliography",tags,file,itemType,collection,public,featured
107,https://di.lib.vt.edu/items/show/107,,,,,"1972-09 (photo taken)",,,,,,,,,,,,,,"Leonard J. Currie Slides",,,,,"Andrew Kroll, ""AD Classics: Yoyogi National Gym / Kenzo Tange"". arch daily. Accessed 2017-02-06.^^https://www.archdaily.com/109138/ad-classics-yoyogi-national-gymnasium-kenzo-tange",,,,"color slides",,"Tokyo, Tōkyō, Kanto, Japan",,,,,,,,,"Virginia Polytechnic Institute and State University. University Libraries^^Virginia Polytechnic Institute and State University. University Libraries. Special Collections Department (Repository)","Estate of Leonard J. Currie","Yoyogi National Gym, Tokyo, by Kenzo Tange","Japanese^^exterior views^^sports buildings^^Asia^^Japan",,"Currie, Leonard J. (Leonard James), 1913-1996  (Photographer)",,,,"Tange, Kenzo, 1913-2005 (Architect)",http://rightsstatements.org/vocab/InC-EDU/1.0/,"Virginia Tech Libraries Special Collections^^http://aspace.lib.vt.edu/repositories/2/resources/2315",image/jpeg,,Image,LJC_139_067,,,,,,,,,,,,,,,,,,,,,,,,,,,,,,,,,,,,"Asia,Currie - Leonard J,exterior views,Japan,Japanese,Leonard J. Currie Slides,sports buildings,Tange - Kenzo",https://di.lib.vt.edu/files/original/Leonard_J._Currie_s_Slides_Collection/LJC_139_067/LJC_139_067.jpg,,Japan,1,0
106,https://di.lib.vt.edu/items/show/106,,,,,"1972-09 (photo taken)",,,,,,,,,,,,,,"Leonard J. Currie Slides",,,,,"Andrew Kroll, ""AD Classics: Yoyogi National Gym / Kenzo Tange"". arch daily. Accessed 2017-02-06.^^https://www.archdaily.com/109138/ad-classics-yoyogi-national-gymnasium-kenzo-tange",,,,"color slides",,"Tokyo, Tōkyō, Kanto, Japan",,,,,,,,,"Virginia Polytechnic Institute and State University. University Libraries^^Virginia Polytechnic Institute and State University. University Libraries. Special Collections Department (Repository)","Estate of Leonard J. Currie","Yoyogi National Gym, Tokyo, by Kenzo Tange","Japanese^^exterior views^^sports buildings^^Asia^^Japan",,"Currie, Leonard J. (Leonard James), 1913-1996  (Photographer)",,,,"Tange, Kenzo, 1913-2005 (Architect)",http://rightsstatements.org/vocab/InC-EDU/1.0/,"Virginia Tech Libraries Special Collections^^http://aspace.lib.vt.edu/repositories/2/resources/2315",image/jpeg,,Image,LJC_139_066,,,,,,,,,,,,,,,,,,,,,,,,,,,,,,,,,,,,"Asia,Currie - Leonard J,exterior views,Japan,Japanese,Leonard J. Currie Slides,sports buildings,Tange - Kenzo",https://di.lib.vt.edu/files/original/Leonard_J._Currie_s_Slides_Collection/LJC_139_066/LJC_139_066.jpg,,Japan,1,0
105,https://di.lib.vt.edu/items/show/105,,,,,"1972-09 (photo taken)",,,,,,,,,,,,,,"Leonard J. Currie Slides",,,,,"Andrew Kroll, ""AD Classics: Yoyogi National Gym / Kenzo Tange"". arch daily. Accessed 2017-02-06.^^https://www.archdaily.com/109138/ad-classics-yoyogi-national-gymnasium-kenzo-tange",,,,"color slides",,"Tokyo, Tōkyō, Kanto, Japan",,,,,,,,,"Virginia Polytechnic Institute and State University. University Libraries^^Virginia Polytechnic Institute and State University. University Libraries. Special Collections Department (Repository)","Estate of Leonard J. Currie","Yoyogi National Gym, Tokyo, by Kenzo Tange","Japanese^^exterior views^^sports buildings^^Asia^^Japan",,"Currie, Leonard J. (Leonard James), 1913-1996  (Photographer)",,,,"Tange, Kenzo, 1913-2005 (Architect)",http://rightsstatements.org/vocab/InC-EDU/1.0/,"Virginia Tech Libraries Special Collections^^http://aspace.lib.vt.edu/repositories/2/resources/2315",image/jpeg,,Image,LJC_139_065,,,,,,,,,,,,,,,,,,,,,,,,,,,,,,,,,,,,"Asia,Currie - Leonard J,exterior views,Japan,Japanese,Leonard J. Currie Slides,sports buildings,Tange - Kenzo",https://di.lib.vt.edu/files/original/Leonard_J._Currie_s_Slides_Collection/LJC_139_065/LJC_139_065.jpg,,Japan,1,0
104,https://di.lib.vt.edu/items/show/104,,,,,"1972-09 (photo taken)",,,,,,,,,,,,,,"Leonard J. Currie Slides",,,,,"Andrew Kroll, ""AD Classics: Yoyogi National Gym / Kenzo Tange"". arch daily. Accessed 2017-02-06.^^https://www.archdaily.com/109138/ad-classics-yoyogi-national-gymnasium-kenzo-tange",,,,"color slides",,"Tokyo, Tōkyō, Kanto, Japan",,,,,,,,,"Virginia Polytechnic Institute and State University. University Libraries^^Virginia Polytechnic Institute and State University. University Libraries. Special Collections Department (Repository)","Estate of Leonard J. Currie","Yoyogi National Gym, Tokyo, by Kenzo Tange","Japanese^^exterior views^^sports buildings^^Asia^^Japan",Entrance,"Currie, Leonard J. (Leonard James), 1913-1996  (Photographer)",,,,"Tange, Kenzo, 1913-2005 (Architect)",http://rightsstatements.org/vocab/InC-EDU/1.0/,"Virginia Tech Libraries Special Collections^^http://aspace.lib.vt.edu/repositories/2/resources/2315",image/jpeg,,Image,LJC_139_064,,,,,,,,,,,,,,,,,,,,,,,,,,,,,,,,,,,,"Asia,Currie - Leonard J,exterior views,Japan,Japanese,Leonard J. Currie Slides,sports buildings,Tange - Kenzo",https://di.lib.vt.edu/files/original/Leonard_J._Currie_s_Slides_Collection/LJC_139_064/LJC_139_064.jpg,,Japan,1,0
110,https://di.lib.vt.edu/items/show/110,,,,,"1972-09 (photo taken)",,,,,,,,,,,,,,"Leonard J. Currie Slides",,,,,"""Nigatsu-dō"", Wikipedia. Accessed 2018-02-05^^Carlo Fumerola, ""Nara  Koen_Nigatsu-do"", Flickr. Accessed 2018-02-05^^https://en.wikipedia.org/wiki/Nigatsu-d%C5%8D^^https://flic.kr/p/8Gr3iV",,,,"color slides",,"Nara, Nara, Kinki, Japan",,,,,,,,,"Virginia Polytechnic Institute and State University. University Libraries^^Virginia Polytechnic Institute and State University. University Libraries. Special Collections Department (Repository)","Estate of Leonard J. Currie","Wood treasury, Nigatsu-do, Todai-ji Temple, Nara","Japanese^^entrances^^exterior views^^religious buildings^^works of art^^religious complexes^^Asia^^Japan",,"Currie, Leonard J. (Leonard James), 1913-1996  (Photographer)",,,,,http://rightsstatements.org/vocab/InC-EDU/1.0/,"Virginia Tech Libraries Special Collections^^http://aspace.lib.vt.edu/repositories/2/resources/2315",image/jpeg,,Image,LJC_140_003,,,,,,,,,,,,,,,,,,,,,,,,,,,,,,,,,,,,"Asia,Currie - Leonard J,entrances,exterior views,Japan,Japanese,Leonard J. Currie Slides,religious buildings,religious complexes,works of art",https://di.lib.vt.edu/files/original/Leonard_J._Currie_s_Slides_Collection/LJC_140_003/LJC_140_003.jpg,,Japan,1,0
109,https://di.lib.vt.edu/items/show/109,,,,,"1972-09 (photo taken)",,,,,,,,,,,,,,"Leonard J. Currie Slides",,,,,"""Nigatsu-dō"", Wikipedia. Accessed 2018-02-05^^Carlo Fumerola, ""Nara  Koen_Nigatsu-do"", Flickr. Accessed 2018-02-05^^https://en.wikipedia.org/wiki/Nigatsu-d%C5%8D^^https://flic.kr/p/8Gr3iV",,,,"color slides",,"Nara, Nara, Kinki, Japan",,,,,,,,,"Virginia Polytechnic Institute and State University. University Libraries^^Virginia Polytechnic Institute and State University. University Libraries. Special Collections Department (Repository)","Estate of Leonard J. Currie","Wood treasury, Nigatsu-do, Todai-ji Temple, Nara","Japanese^^exterior views^^religious buildings^^religious complexes^^Asia^^Japan",,"Currie, Leonard J. (Leonard James), 1913-1996  (Photographer)",,,,,http://rightsstatements.org/vocab/InC-EDU/1.0/,"Virginia Tech Libraries Special Collections^^http://aspace.lib.vt.edu/repositories/2/resources/2315",image/jpeg,,Image,LJC_140_002,,,,,,,,,,,,,,,,,,,,,,,,,,,,,,,,,,,,"Asia,Currie - Leonard J,exterior views,Japan,Japanese,Leonard J. Currie Slides,religious buildings,religious complexes",https://di.lib.vt.edu/files/original/Leonard_J._Currie_s_Slides_Collection/LJC_140_002/LJC_140_002.jpg,,Japan,1,0
92,https://di.lib.vt.edu/items/show/92,,,,,"1972-09 (photo taken)",,,,,,,,,,,,,,"Leonard J. Currie Slides",,,,,,,,,"color slides",,"Tokyo, Tōkyō, Kanto, Japan",,,,,,,,,"Virginia Polytechnic Institute and State University. University Libraries^^Virginia Polytechnic Institute and State University. University Libraries. Special Collections Department (Repository)","Estate of Leonard J. Currie","Tokyo Prefecture City Hall by Kenzo Tange","Japanese^^interior views^^office buildings^^Asia^^Japan",Lobby,"Currie, Leonard J. (Leonard James), 1913-1996  (Photographer)",,,,,http://rightsstatements.org/vocab/InC-EDU/1.0/,"Virginia Tech Libraries Special Collections^^http://aspace.lib.vt.edu/repositories/2/resources/2315",image/jpeg,,Image,LJC_139_052,,,,,,,,,,,,,,,,,,,,,,,,,,,,,,,,,,,,"Asia,Currie - Leonard J,interior views,Japan,Japanese,Leonard J. Currie Slides,office buildings,Tange - Kenzo",https://di.lib.vt.edu/files/original/Leonard_J._Currie_s_Slides_Collection/LJC_139_052/LJC_139_052.jpg,,Japan,1,0
91,https://di.lib.vt.edu/items/show/91,,,,,"1972-09 (photo taken)",,,,,,,,,,,,,,"Leonard J. Currie Slides",,,,,,,,,"color slides",,"Tokyo, Tōkyō, Kanto, Japan",,,,,,,,,"Virginia Polytechnic Institute and State University. University Libraries^^Virginia Polytechnic Institute and State University. University Libraries. Special Collections Department (Repository)","Estate of Leonard J. Currie","Tokyo Prefecture City Hall by Kenzo Tange","Japanese^^office buildings^^exterior views^^Asia^^Japan","Adjacent area","Currie, Leonard J. (Leonard James), 1913-1996  (Photographer)",,,,"Tange, Kenzo, 1913-2005 (Architect)",http://rightsstatements.org/vocab/InC-EDU/1.0/,"Virginia Tech Libraries Special Collections^^http://aspace.lib.vt.edu/repositories/2/resources/2315",image/jpeg,,Image,LJC_139_051,,,,,,,,,,,,,,,,,,,,,,,,,,,,,,,,,,,,"Asia,Currie - Leonard J,exterior views,Japan,Japanese,Leonard J. Currie Slides,office buildings,Tange - Kenzo",https://di.lib.vt.edu/files/original/Leonard_J._Currie_s_Slides_Collection/LJC_139_051/LJC_139_051.jpg,,Japan,1,0
179,https://di.lib.vt.edu/items/show/179,,,,,"1972-09 (photo taken)",,,,,,,,,,,,,,"Leonard J. Currie Slides",,,,,,,,,"color slides",,"Nara, Nara, Kinki, Japan",,,,,,,,,"Virginia Polytechnic Institute and State University. University Libraries^^Virginia Polytechnic Institute and State University. University Libraries. Special Collections Department (Repository)","Estate of Leonard J. Currie","Todai-ji Temple, Nara","Japanese^^works of art^^religious buildings^^interior views^^religious complexes^^Asia^^Japan",,"Currie, Leonard J. (Leonard James), 1913-1996  (Photographer)",,,,,http://rightsstatements.org/vocab/InC-EDU/1.0/,"Virginia Tech Libraries Special Collections^^http://aspace.lib.vt.edu/repositories/2/resources/2315",image/jpeg,,Image,LJC_141_035,,,,,,,,,,,,,,,,,,,,,,,,,,,,,,,,,,,,"Asia,Currie - Leonard J,interior views,Japan,Japanese,Leonard J. Currie Slides,religious buildings,religious complexes,works of art",https://di.lib.vt.edu/files/original/Leonard_J._Currie_s_Slides_Collection/LJC_141_035/LJC_141_035.jpg,,Japan,1,0
178,https://di.lib.vt.edu/items/show/178,,,,,"1972-09 (photo taken)",,,,,,,,,,,,,,"Leonard J. Currie Slides",,,,,,,,,"color slides",,"Nara, Nara, Kinki, Japan",,,,,,,,,"Virginia Polytechnic Institute and State University. University Libraries^^Virginia Polytechnic Institute and State University. University Libraries. Special Collections Department (Repository)","Estate of Leonard J. Currie","Todai-ji Temple, Nara","Japanese^^religious buildings^^interior views^^works of art^^religious complexes^^Asia^^Japan",,"Currie, Leonard J. (Leonard James), 1913-1996  (Photographer)",,,,,http://rightsstatements.org/vocab/InC-EDU/1.0/,"Virginia Tech Libraries Special Collections^^http://aspace.lib.vt.edu/repositories/2/resources/2315",image/jpeg,,Image,LJC_141_034,,,,,,,,,,,,,,,,,,,,,,,,,,,,,,,,,,,,"Asia,Currie - Leonard J,interior views,Japan,Japanese,Leonard J. Currie Slides,religious buildings,religious complexes,works of art",https://di.lib.vt.edu/files/original/Leonard_J._Currie_s_Slides_Collection/LJC_141_034/LJC_141_034.jpg,,Japan,1,0
177,https://di.lib.vt.edu/items/show/177,,,,,"1972-09 (photo taken)",,,,,,,,,,,,,,"Leonard J. Currie Slides",,,,,,,,,"color slides",,"Nara, Nara, Kinki, Japan",,,,,,,,,"Virginia Polytechnic Institute and State University. University Libraries^^Virginia Polytechnic Institute and State University. University Libraries. Special Collections Department (Repository)","Estate of Leonard J. Currie","Todai-ji Temple, Nara","Japanese^^interior views^^religious buildings^^works of art^^religious complexes^^Asia^^Japan",,"Currie, Leonard J. (Leonard James), 1913-1996  (Photographer)",,,,,http://rightsstatements.org/vocab/InC-EDU/1.0/,"Virginia Tech Libraries Special Collections^^http://aspace.lib.vt.edu/repositories/2/resources/2315",image/jpeg,,Image,LJC_141_033,,,,,,,,,,,,,,,,,,,,,,,,,,,,,,,,,,,,"Asia,Currie - Leonard J,interior views,Japan,Japanese,Leonard J. Currie Slides,religious buildings,religious complexes,works of art",https://di.lib.vt.edu/files/original/Leonard_J._Currie_s_Slides_Collection/LJC_141_033/LJC_141_033.jpg,,Japan,1,0
176,https://di.lib.vt.edu/items/show/176,,,,,"1972-09 (photo taken)",,,,,,,,,,,,,,"Leonard J. Currie Slides",,,,,,,,,"color slides",,"Nara, Nara, Kinki, Japan",,,,,,,,,"Virginia Polytechnic Institute and State University. University Libraries^^Virginia Polytechnic Institute and State University. University Libraries. Special Collections Department (Repository)","Estate of Leonard J. Currie","Todai-ji Temple, Nara","Japanese^^religious complexes^^landscape gardening^^Asia^^Japan",,"Currie, Leonard J. (Leonard James), 1913-1996  (Photographer)",,,,,http://rightsstatements.org/vocab/InC-EDU/1.0/,"Virginia Tech Libraries Special Collections^^http://aspace.lib.vt.edu/repositories/2/resources/2315",image/jpeg,,Image,LJC_141_032,,,,,,,,,,,,,,,,,,,,,,,,,,,,,,,,,,,,"Asia,Currie - Leonard J,Japan,Japanese,landscape gardening,Leonard J. Currie Slides,religious complexes",https://di.lib.vt.edu/files/original/Leonard_J._Currie_s_Slides_Collection/LJC_141_032/LJC_141_032.jpg,,Japan,1,0
175,https://di.lib.vt.edu/items/show/175,,,,,"1972-09 (photo taken)",,,,,,,,,,,,,,"Leonard J. Currie Slides",,,,,,,,,"color slides",,"Nara, Nara, Kinki, Japan",,,,,,,,,"Virginia Polytechnic Institute and State University. University Libraries^^Virginia Polytechnic Institute and State University. University Libraries. Special Collections Department (Repository)","Estate of Leonard J. Currie","Todai-ji Temple, Nara","Japanese^^exterior views^^religious buildings^^entrances^^religious complexes^^Asia^^Japan",,"Currie, Leonard J. (Leonard James), 1913-1996  (Photographer)",,,,,http://rightsstatements.org/vocab/InC-EDU/1.0/,"Virginia Tech Libraries Special Collections^^http://aspace.lib.vt.edu/repositories/2/resources/2315",image/jpeg,,Image,LJC_141_031,,,,,,,,,,,,,,,,,,,,,,,,,,,,,,,,,,,,"Asia,Currie - Leonard J,entrances,exterior views,Japan,Japanese,Leonard J. Currie Slides,religious buildings,religious complexes",https://di.lib.vt.edu/files/original/Leonard_J._Currie_s_Slides_Collection/LJC_141_031/LJC_141_031.jpg,,Japan,1,0
174,https://di.lib.vt.edu/items/show/174,,,,,"1972-09 (photo taken)",,,,,,,,,,,,,,"Leonard J. Currie Slides",,,,,,,,,"color slides",,"Nara, Nara, Kinki, Japan",,,,,,,,,"Virginia Polytechnic Institute and State University. University Libraries^^Virginia Polytechnic Institute and State University. University Libraries. Special Collections Department (Repository)","Estate of Leonard J. Currie","Todai-ji Temple, Nara","Japanese^^religious complexes^^landscape gardening^^Asia^^Japan",,"Currie, Leonard J. (Leonard James), 1913-1996  (Photographer)",,,,,http://rightsstatements.org/vocab/InC-EDU/1.0/,"Virginia Tech Libraries Special Collections^^http://aspace.lib.vt.edu/repositories/2/resources/2315",image/jpeg,,Image,LJC_141_030,,,,,,,,,,,,,,,,,,,,,,,,,,,,,,,,,,,,"Asia,Currie - Leonard J,Japan,Japanese,landscape gardening,Leonard J. Currie Slides,religious complexes",https://di.lib.vt.edu/files/original/Leonard_J._Currie_s_Slides_Collection/LJC_141_030/LJC_141_030.jpg,,Japan,1,0
173,https://di.lib.vt.edu/items/show/173,,,,,"1972-09 (photo taken)",,,,,,,,,,,,,,"Leonard J. Currie Slides",,,,,,,,,"color slides",,"Nara, Nara, Kinki, Japan",,,,,,,,,"Virginia Polytechnic Institute and State University. University Libraries^^Virginia Polytechnic Institute and State University. University Libraries. Special Collections Department (Repository)","Estate of Leonard J. Currie","Todai-ji Temple, Nara","Japanese^^Currie, Virginia M. Herz, 1937-2000^^religious complexes^^landscape gardening^^Asia^^Japan",,"Currie, Leonard J. (Leonard James), 1913-1996  (Photographer)",,,,,http://rightsstatements.org/vocab/InC-EDU/1.0/,"Virginia Tech Libraries Special Collections^^http://aspace.lib.vt.edu/repositories/2/resources/2315",image/jpeg,,Image,LJC_141_029,,,,,,,,,,,,,,,,,,,,,,,,,,,,,,,,,,,,"Asia,Currie - Leonard J,Currie - Virginia M Herz,Japan,Japanese,landscape gardening,Leonard J. Currie Slides,religious complexes",https://di.lib.vt.edu/files/original/Leonard_J._Currie_s_Slides_Collection/LJC_141_029/LJC_141_029.jpg,,Japan,1,0
172,https://di.lib.vt.edu/items/show/172,,,,,"1972-09 (photo taken)",,,,,,,,,,,,,,"Leonard J. Currie Slides",,,,,,,,,"color slides",,"Nara, Nara, Kinki, Japan",,,,,,,,,"Virginia Polytechnic Institute and State University. University Libraries^^Virginia Polytechnic Institute and State University. University Libraries. Special Collections Department (Repository)","Estate of Leonard J. Currie","Todai-ji Temple, Nara","Japanese^^landscape gardening^^religious complexes^^Asia^^Japan",,"Currie, Leonard J. (Leonard James), 1913-1996  (Photographer)",,,,,http://rightsstatements.org/vocab/InC-EDU/1.0/,"Virginia Tech Libraries Special Collections^^http://aspace.lib.vt.edu/repositories/2/resources/2315",image/jpeg,,Image,LJC_141_028,,,,,,,,,,,,,,,,,,,,,,,,,,,,,,,,,,,,"Asia,Currie - Leonard J,Japan,Japanese,landscape gardening,Leonard J. Currie Slides,religious complexes",https://di.lib.vt.edu/files/original/Leonard_J._Currie_s_Slides_Collection/LJC_141_028/LJC_141_028.jpg,,Japan,1,0
171,https://di.lib.vt.edu/items/show/171,,,,,"1972-09 (photo taken)",,,,,,,,,,,,,,"Leonard J. Currie Slides",,,,,,,,,"color slides",,"Nara, Nara, Kinki, Japan",,,,,,,,,"Virginia Polytechnic Institute and State University. University Libraries^^Virginia Polytechnic Institute and State University. University Libraries. Special Collections Department (Repository)","Estate of Leonard J. Currie","Todai-ji Temple, Nara","Japanese^^religious complexes^^landscape gardening^^Asia^^Japan",,"Currie, Leonard J. (Leonard James), 1913-1996  (Photographer)",,,,,http://rightsstatements.org/vocab/InC-EDU/1.0/,"Virginia Tech Libraries Special Collections^^http://aspace.lib.vt.edu/repositories/2/resources/2315",image/jpeg,,Image,LJC_141_027,,,,,,,,,,,,,,,,,,,,,,,,,,,,,,,,,,,,"Asia,Currie - Leonard J,Japan,Japanese,landscape gardening,Leonard J. Currie Slides,religious complexes",https://di.lib.vt.edu/files/original/Leonard_J._Currie_s_Slides_Collection/LJC_141_027/LJC_141_027.jpg,,Japan,1,0
108,https://di.lib.vt.edu/items/show/108,,,,,"1972-09 (photo taken)",,,,,,,,,,,,,,"Leonard J. Currie Slides",,,,,,,,,"color slides",,"Nara, Nara, Kinki, Japan",,,,,,,,,"Virginia Polytechnic Institute and State University. University Libraries^^Virginia Polytechnic Institute and State University. University Libraries. Special Collections Department (Repository)","Estate of Leonard J. Currie","Todai-ji Temple, Nara","Japanese^^exterior views^^entrances^^religious buildings^^religious complexes^^Asia^^Japan",,"Currie, Leonard J. (Leonard James), 1913-1996  (Photographer)",,,,,http://rightsstatements.org/vocab/InC-EDU/1.0/,"Virginia Tech Libraries Special Collections^^http://aspace.lib.vt.edu/repositories/2/resources/2315",image/jpeg,,Image,LJC_140_001,,,,,,,,,,,,,,,,,,,,,,,,,,,,,,,,,,,,"Asia,Currie - Leonard J,entrances,exterior views,Japan,Japanese,Leonard J. Currie Slides,religious buildings,religious complexes",https://di.lib.vt.edu/files/original/Leonard_J._Currie_s_Slides_Collection/LJC_140_001/LJC_140_001.jpg,,Japan,1,0
1074,https://di.lib.vt.edu/items/show/1074,,,,,"1972-09 (photo taken)",,,,,,,,,,,,,,"Leonard J. Currie Slides",,,,,,,,,"color slides",,"Kyoto, Kyōto, Kinki, Japan",,,,,,,,,"Virginia Polytechnic Institute and State University. University Libraries^^Virginia Polytechnic Institute and State University. University Libraries. Special Collections Department (Repository)","Estate of Leonard J. Currie","Shugaku-in Imperial Villa, Kyoto","Japanese^^palace complexes^^palaces^^landscape gardening^^Leonard J. Currie Slides^^Asia^^Japan",,"Currie, Leonard J. (Leonard James), 1913-1996 (Photographer)",,,,,http://rightsstatements.org/vocab/InC-EDU/1.0/,"Virginia Tech Libraries Special Collections^^http://aspace.lib.vt.edu/repositories/2/resources/2315",,,Image,LJC_135_026,,,,,,,,,,,,,,,,,,,,,,,,,,,,,,,,,,,,"Asia,Currie - Leonard J,Japan,Japanese,landscape gardening,Leonard J. Currie Slides,palace complexes,palaces",https://di.lib.vt.edu/files/original/Leonard_J._Currie_s_Slides_Collection/LJC_135_026/LJC_135_026.jpg,,Japan,1,0