﻿"Item Id","Item URI","Dublin Core:Alternative Title","Dublin Core:Abstract","Dublin Core:Table Of Contents","Dublin Core:Date Available","Dublin Core:Date Created","Dublin Core:Date Accepted","Dublin Core:Date Copyrighted","Dublin Core:Date Submitted","Dublin Core:Date Issued","Dublin Core:Date Modified","Dublin Core:Date Valid","Dublin Core:Access Rights","Dublin Core:License","Dublin Core:Conforms To","Dublin Core:Has Format","Dublin Core:Has Part","Dublin Core:Has Version","Dublin Core:Is Format Of","Dublin Core:Is Part Of","Dublin Core:Is Referenced By","Dublin Core:Is Replaced By","Dublin Core:Is Required By","Dublin Core:Is Version Of","Dublin Core:References","Dublin Core:Replaces","Dublin Core:Requires","Dublin Core:Extent","Dublin Core:Medium","Dublin Core:Bibliographic Citation","Dublin Core:Spatial Coverage","Dublin Core:Temporal Coverage","Dublin Core:Accrual Method","Dublin Core:Accrual Periodicity","Dublin Core:Accrual Policy","Dublin Core:Audience","Dublin Core:Audience Education Level","Dublin Core:Mediator","Dublin Core:Instructional Method","Dublin Core:Provenance","Dublin Core:Rights Holder","Dublin Core:Title","Dublin Core:Subject","Dublin Core:Description","Dublin Core:Creator","Dublin Core:Source","Dublin Core:Publisher","Dublin Core:Date","Dublin Core:Contributor","Dublin Core:Rights","Dublin Core:Relation","Dublin Core:Format","Dublin Core:Language","Dublin Core:Type","Dublin Core:Identifier","Dublin Core:Coverage","Item Type Metadata:Text","Item Type Metadata:Interviewer","Item Type Metadata:Interviewee","Item Type Metadata:Location","Item Type Metadata:Transcription","Item Type Metadata:Local URL","Item Type Metadata:Original Format","Item Type Metadata:Physical Dimensions","Item Type Metadata:Duration","Item Type Metadata:Compression","Item Type Metadata:Producer","Item Type Metadata:Director","Item Type Metadata:Bit Rate/Frequency","Item Type Metadata:Time Summary","Item Type Metadata:Email Body","Item Type Metadata:Subject Line","Item Type Metadata:From","Item Type Metadata:To","Item Type Metadata:CC","Item Type Metadata:BCC","Item Type Metadata:Number of Attachments","Item Type Metadata:Standards","Item Type Metadata:Objectives","Item Type Metadata:Materials","Item Type Metadata:Lesson Plan Text","Item Type Metadata:URL","Item Type Metadata:Event Type","Item Type Metadata:Participants","Item Type Metadata:Birth Date","Item Type Metadata:Birthplace","Item Type Metadata:Death Date","Item Type Metadata:Occupation","Item Type Metadata:Biographical Text","Item Type Metadata:Bibliography",tags,file,itemType,collection,public,featured
3210,https://di.lib.vt.edu/items/show/3210,,,,,"1961-12 (photo taken)",,,,,,,,,,,,,,,,,,,"National Register Final Nomination^^Selected Modernist Architects in Virginia: Biographical Sketches By Josh Howard^^http://www.dhr.virginia.gov/registers/Counties/Montgomery/150-0019_Currie_House_1994_Final_Nomination.pdf^^http://www.dhr.virginia.gov/NewDominion/ArchitectBios_Howard_Final.pdf",,,,"color slides",,"Blacksburg, Montgomery, Virginia, United States",,,,,,,,,"Virginia Polytechnic Institute and State University. University Libraries^^Virginia Polytechnic Institute and State University. University Libraries. Special Collections Department (Repository)","Estate of Leonard J. Currie","Currie House (1961)","American^^residential structures^^entrances^^exterior views^^porches^^landscape gardening^^houses^^Currie House I (Blacksburg) Completed^^Leonard J. Currie Slides^^Currie House I (Blacksburg)","Currie House / Trower House / Colloquially the ""Pagoda House""","Currie, Leonard J. (Leonard James), 1913-1996 (Photographer)",,,,"Currie, Leonard J. (Leonard James), 1913-1996 (Architect)",http://rightsstatements.org/vocab/InC-EDU/1.0/,"Virginia Tech Libraries Special Collections^^http://aspace.lib.vt.edu/repositories/2/resources/2315",,,Image,LJC_148_038,,,,,,,,,,,,,,,,,,,,,,,,,,,,,,,,,,,,"American,Currie - Leonard J,Currie House I (Blacksburg),Currie House I (Blacksburg) Completed,entrances,exterior views,houses,landscape gardening,Leonard J. Currie Slides,porches,residential structures",https://di.lib.vt.edu/files/original/Leonard_J._Currie_s_Slides_Collection/LJC_148_038/LJC_148_038.jpg,,"United States",1,0
3205,https://di.lib.vt.edu/items/show/3205,,,,,"1961-06 (photo taken)",,,,,,,,,,,,,,,,,,,"National Register Final Nomination^^Selected Modernist Architects in Virginia: Biographical Sketches By Josh Howard^^http://www.dhr.virginia.gov/registers/Counties/Montgomery/150-0019_Currie_House_1994_Final_Nomination.pdf^^http://www.dhr.virginia.gov/NewDominion/ArchitectBios_Howard_Final.pdf",,,,"color slides",,"Blacksburg, Montgomery, Virginia, United States",,,,,,,,,"Virginia Polytechnic Institute and State University. University Libraries^^Virginia Polytechnic Institute and State University. University Libraries. Special Collections Department (Repository)","Estate of Leonard J. Currie","Currie House (1961)","American^^interior views^^residential structures^^entrances^^houses^^Currie House I (Blacksburg) Completed^^Leonard J. Currie Slides^^Currie House I (Blacksburg)","Currie House / Trower House / Colloquially the ""Pagoda House""","Clark, Don (Photographer)",,,,"Currie, Leonard J. (Leonard James), 1913-1996 (Architect)",http://rightsstatements.org/vocab/InC-EDU/1.0/,"Virginia Tech Libraries Special Collections^^http://aspace.lib.vt.edu/repositories/2/resources/2315",,,Image,LJC_148_033,,,,,,,,,,,,,,,,,,,,,,,,,,,,,,,,,,,,"American,Clark - Don,Currie - Leonard J,Currie House I (Blacksburg),Currie House I (Blacksburg) Completed,entrances,houses,interior views,Leonard J. Currie Slides,residential structures",https://di.lib.vt.edu/files/original/Leonard_J._Currie_s_Slides_Collection/LJC_148_033/LJC_148_033.jpg,,"United States",1,0
3150,https://di.lib.vt.edu/items/show/3150,,,,,"1986-08 (slide developed)",,,,,,,,,,,,,,,,,,,,,,,"color slides",,"Blacksburg, Montgomery, Virginia, United States",,,,,,,,,"Virginia Polytechnic Institute and State University. University Libraries^^Virginia Polytechnic Institute and State University. University Libraries. Special Collections Department (Repository)","Estate of Leonard J. Currie","Ogburn House","American^^residential structures^^houses^^construction (assembling)^^entrances^^interior views^^Leonard J. Currie Slides^^Currie Projects^^Ogburn House",,"Currie, Leonard J. (Leonard James), 1913-1996 (Photographer)",,,,"Currie, Leonard J. (Leonard James), 1913-1996 (Architect)",http://rightsstatements.org/vocab/InC-EDU/1.0/,"Virginia Tech Libraries Special Collections^^http://aspace.lib.vt.edu/repositories/2/resources/2315",,,Image,LJC_143_017,,,,,,,,,,,,,,,,,,,,,,,,,,,,,,,,,,,,"American,construction (assembling),Currie - Leonard J,Currie Projects,entrances,houses,interior views,Leonard J. Currie Slides,Ogburn House,residential structures",https://di.lib.vt.edu/files/original/Leonard_J._Currie_s_Slides_Collection/LJC_143_017/LJC_143_017.jpg,,"United States",1,0
3148,https://di.lib.vt.edu/items/show/3148,,,,,"1986-08 (slide developed)",,,,,,,,,,,,,,,,,,,,,,,"color slides",,"Blacksburg, Montgomery, Virginia, United States",,,,,,,,,"Virginia Polytechnic Institute and State University. University Libraries^^Virginia Polytechnic Institute and State University. University Libraries. Special Collections Department (Repository)","Estate of Leonard J. Currie","Ogburn House","American^^residential structures^^houses^^exterior views^^construction (assembling)^^entrances^^Leonard J. Currie Slides^^Currie Projects^^Ogburn House",,"Currie, Leonard J. (Leonard James), 1913-1996 (Photographer)",,,,"Currie, Leonard J. (Leonard James), 1913-1996 (Architect)",http://rightsstatements.org/vocab/InC-EDU/1.0/,"Virginia Tech Libraries Special Collections^^http://aspace.lib.vt.edu/repositories/2/resources/2315",,,Image,LJC_143_015,,,,,,,,,,,,,,,,,,,,,,,,,,,,,,,,,,,,"American,construction (assembling),Currie - Leonard J,Currie Projects,entrances,exterior views,houses,Leonard J. Currie Slides,Ogburn House,residential structures",https://di.lib.vt.edu/files/original/Leonard_J._Currie_s_Slides_Collection/LJC_143_015/LJC_143_015.jpg,,"United States",1,0
3145,https://di.lib.vt.edu/items/show/3145,,,,,"1986-08 (slide developed)",,,,,,,,,,,,,,,,,,,,,,,"color slides",,"Blacksburg, Montgomery, Virginia, United States",,,,,,,,,"Virginia Polytechnic Institute and State University. University Libraries^^Virginia Polytechnic Institute and State University. University Libraries. Special Collections Department (Repository)","Estate of Leonard J. Currie","Ogburn House","American^^residential structures^^houses^^exterior views^^construction (assembling)^^entrances^^Leonard J. Currie Slides^^Currie Projects^^Ogburn House",,"Currie, Leonard J. (Leonard James), 1913-1996 (Photographer)",,,,"Currie, Leonard J. (Leonard James), 1913-1996 (Architect)",http://rightsstatements.org/vocab/InC-EDU/1.0/,"Virginia Tech Libraries Special Collections^^http://aspace.lib.vt.edu/repositories/2/resources/2315",,,Image,LJC_143_012,,,,,,,,,,,,,,,,,,,,,,,,,,,,,,,,,,,,"American,construction (assembling),Currie - Leonard J,Currie Projects,entrances,exterior views,houses,Leonard J. Currie Slides,Ogburn House,residential structures",https://di.lib.vt.edu/files/original/Leonard_J._Currie_s_Slides_Collection/LJC_143_012/LJC_143_012.jpg,,"United States",1,0
3143,https://di.lib.vt.edu/items/show/3143,,,,,"1986-08 (slide developed)",,,,,,,,,,,,,,,,,,,,,,,"color slides",,"Blacksburg, Montgomery, Virginia, United States",,,,,,,,,"Virginia Polytechnic Institute and State University. University Libraries^^Virginia Polytechnic Institute and State University. University Libraries. Special Collections Department (Repository)","Estate of Leonard J. Currie","Ogburn House","American^^residential structures^^houses^^exterior views^^construction (assembling)^^entrances^^Leonard J. Currie Slides^^Currie Projects^^Ogburn House",,"Currie, Leonard J. (Leonard James), 1913-1996 (Photographer)",,,,"Currie, Leonard J. (Leonard James), 1913-1996 (Architect)",http://rightsstatements.org/vocab/InC-EDU/1.0/,"Virginia Tech Libraries Special Collections^^http://aspace.lib.vt.edu/repositories/2/resources/2315",,,Image,LJC_143_010,,,,,,,,,,,,,,,,,,,,,,,,,,,,,,,,,,,,"American,construction (assembling),Currie - Leonard J,Currie Projects,entrances,exterior views,houses,Leonard J. Currie Slides,Ogburn House,residential structures",https://di.lib.vt.edu/files/original/Leonard_J._Currie_s_Slides_Collection/LJC_143_010/LJC_143_010.jpg,,"United States",1,0
3142,https://di.lib.vt.edu/items/show/3142,,,,,"1986-08 (slide developed)",,,,,,,,,,,,,,,,,,,,,,,"color slides",,"Blacksburg, Montgomery, Virginia, United States",,,,,,,,,"Virginia Polytechnic Institute and State University. University Libraries^^Virginia Polytechnic Institute and State University. University Libraries. Special Collections Department (Repository)","Estate of Leonard J. Currie","Ogburn House","American^^residential structures^^houses^^exterior views^^construction (assembling)^^entrances^^Leonard J. Currie Slides^^Currie Projects^^Ogburn House",,"Currie, Leonard J. (Leonard James), 1913-1996 (Photographer)",,,,"Currie, Leonard J. (Leonard James), 1913-1996 (Architect)",http://rightsstatements.org/vocab/InC-EDU/1.0/,"Virginia Tech Libraries Special Collections^^http://aspace.lib.vt.edu/repositories/2/resources/2315",,,Image,LJC_143_009,,,,,,,,,,,,,,,,,,,,,,,,,,,,,,,,,,,,"American,construction (assembling),Currie - Leonard J,Currie Projects,entrances,exterior views,houses,Leonard J. Currie Slides,Ogburn House,residential structures",https://di.lib.vt.edu/files/original/Leonard_J._Currie_s_Slides_Collection/LJC_143_009/LJC_143_009.jpg,,"United States",1,0
3104,https://di.lib.vt.edu/items/show/3104,,,,,"1981-06 (photo taken)",,,,,,,,,,,,,,,,,,,,,,,"color slides",,"Blacksburg, Montgomery, Virginia, United States",,,,,,,,,"Virginia Polytechnic Institute and State University. University Libraries^^Virginia Polytechnic Institute and State University. University Libraries. Special Collections Department (Repository)","Estate of Leonard J. Currie","Adger S. Johnson House","American^^exterior views^^landscape gardening^^residential structures^^entrances^^houses^^Leonard J. Currie Slides^^Currie Projects^^Johnson House",,"Currie, Leonard J. (Leonard James), 1913-1996 (Photographer)",,,,"Currie, Leonard J. (Leonard James), 1913-1996 (Architect)",http://rightsstatements.org/vocab/InC-EDU/1.0/,"Virginia Tech Libraries Special Collections^^http://aspace.lib.vt.edu/repositories/2/resources/2315",,,Image,LJC_127_007,,,,,,,,,,,,,,,,,,,,,,,,,,,,,,,,,,,,"American,Currie - Leonard J,Currie Projects,entrances,exterior views,houses,Johnson House,landscape gardening,Leonard J. Currie Slides,residential structures",https://di.lib.vt.edu/files/original/Leonard_J._Currie_s_Slides_Collection/LJC_127_007/LJC_127_007.jpg,,"United States",1,0
3079,https://di.lib.vt.edu/items/show/3079,,,,,"1961 (photo taken)",,,,,,,,,,,,,,,,,,,,,,,"color slides",,"Blacksburg, Montgomery, Virginia, United States",,,,,,,,,"Virginia Polytechnic Institute and State University. University Libraries^^Virginia Polytechnic Institute and State University. University Libraries. Special Collections Department (Repository)","Estate of Leonard J. Currie","Bradley House","American^^exterior views^^residential structures^^entrances^^houses^^Leonard J. Currie Slides^^Currie Projects^^Bradley House",,"Currie, Leonard J. (Leonard James), 1913-1996 (Photographer)",,,,"Currie, Leonard J. (Leonard James), 1913-1996 (Architect)",http://rightsstatements.org/vocab/InC-EDU/1.0/,"Virginia Tech Libraries Special Collections^^http://aspace.lib.vt.edu/repositories/2/resources/2315",,,Image,LJC_124_009,,,,,,,,,,,,,,,,,,,,,,,,,,,,,,,,,,,,"American,Bradley House,Currie - Leonard J,Currie Projects,entrances,exterior views,houses,Leonard J. Currie Slides,residential structures",https://di.lib.vt.edu/files/original/Leonard_J._Currie_s_Slides_Collection/LJC_124_009/LJC_124_009.jpg,,"United States",1,0
2932,https://di.lib.vt.edu/items/show/2932,,,,,,,,,,,,,,,,,,,,,,,,"National Register Final Nomination^^Selected Modernist Architects in Virginia: Biographical Sketches By Josh Howard^^http://www.dhr.virginia.gov/registers/Counties/Montgomery/150-0019_Currie_House_1994_Final_Nomination.pdf^^http://www.dhr.virginia.gov/NewDominion/ArchitectBios_Howard_Final.pdf",,,,"color slides",,"Blacksburg, Montgomery, Virginia, United States",,,,,,,,,"Virginia Polytechnic Institute and State University. University Libraries^^Virginia Polytechnic Institute and State University. University Libraries. Special Collections Department (Repository)","Estate of Leonard J. Currie","Currie House (1961)","American^^interior views^^residential structures^^entrances^^houses^^Currie House I (Blacksburg) Completed^^Leonard J. Currie Slides^^Currie House I (Blacksburg)","Currie House / Trower House / Colloquially the ""Pagoda House""^^Interior, stairway","unidentified photographer",,,,"Currie, Leonard J. (Leonard James), 1913-1996 (Architect)",http://rightsstatements.org/vocab/InC-EDU/1.0/,"Virginia Tech Libraries Special Collections^^http://aspace.lib.vt.edu/repositories/2/resources/2315",,,Image,LJC_056_011,,,,,,,,,,,,,,,,,,,,,,,,,,,,,,,,,,,,"American,Currie - Leonard J,Currie House I (Blacksburg),Currie House I (Blacksburg) Completed,entrances,houses,interior views,Leonard J. Currie Slides,residential structures",https://di.lib.vt.edu/files/original/Leonard_J._Currie_s_Slides_Collection/LJC_056_011/LJC_056_011.jpg,,"United States",1,0
2928,https://di.lib.vt.edu/items/show/2928,,,,,"1961-08 (photo taken)",,,,,,,,,,,,,,,,,,,"National Register Final Nomination^^Selected Modernist Architects in Virginia: Biographical Sketches By Josh Howard^^http://www.dhr.virginia.gov/registers/Counties/Montgomery/150-0019_Currie_House_1994_Final_Nomination.pdf^^http://www.dhr.virginia.gov/NewDominion/ArchitectBios_Howard_Final.pdf",,,,"color slides",,"Blacksburg, Montgomery, Virginia, United States",,,,,,,,,"Virginia Polytechnic Institute and State University. University Libraries^^Virginia Polytechnic Institute and State University. University Libraries. Special Collections Department (Repository)","Estate of Leonard J. Currie","Currie House (1961)","American^^residential structures^^entrances^^exterior views^^porches^^houses^^Currie House I (Blacksburg) Completed^^Leonard J. Currie Slides^^Currie House I (Blacksburg)","Currie House / Trower House / Colloquially the ""Pagoda House""","Currie, Robert G.  (Photographer)",,,,"Currie, Leonard J. (Leonard James), 1913-1996 (Architect)",http://rightsstatements.org/vocab/InC-EDU/1.0/,"Virginia Tech Libraries Special Collections^^http://aspace.lib.vt.edu/repositories/2/resources/2315",,,Image,LJC_056_007,,,,,,,,,,,,,,,,,,,,,,,,,,,,,,,,,,,,"American,Currie - Leonard J,Currie - Robert G,Currie House I (Blacksburg),Currie House I (Blacksburg) Completed,entrances,exterior views,houses,Leonard J. Currie Slides,porches,residential structures",https://di.lib.vt.edu/files/original/Leonard_J._Currie_s_Slides_Collection/LJC_056_007/LJC_056_007.jpg,,"United States",1,0
2921,https://di.lib.vt.edu/items/show/2921,,,,,"1988-03 (photo taken)",,,,,,,,,,,,,,,,,,,,,,,"color slides",,"Blacksburg, Montgomery, Virginia, United States",,,,,,,,,"Virginia Polytechnic Institute and State University. University Libraries^^Virginia Polytechnic Institute and State University. University Libraries. Special Collections Department (Repository)","Estate of Leonard J. Currie","Currie House II","American^^Currie, Leonard J. (Leonard James), 1913-1996^^Currie, Virginia M. Herz, 1937-2000^^exterior views^^residential structures^^entrances^^houses^^portraits^^Currie House II (Blacksburg)^^Leonard J. Currie Slides^^Currie Projects^^Currie House II (Blacksburg) Completed","Leonard and Virginia Currie","unidentified photographer",,,,"Currie, Leonard J. (Leonard James), 1913-1996 (Architect)",http://rightsstatements.org/vocab/InC-EDU/1.0/,"Virginia Tech Libraries Special Collections^^http://aspace.lib.vt.edu/repositories/2/resources/2315",,,Image,LJC_017_058,,,,,,,,,,,,,,,,,,,,,,,,,,,,,,,,,,,,"American,Currie - Leonard J,Currie - Virginia M Herz,Currie House II (Blacksburg),Currie House II (Blacksburg) Completed,Currie Projects,Currie, Leonard J. (Leonard James), 1913-1996,Currie, Virginia M. Herz, 1937-2000,entrances,exterior views,houses,Leonard J. Currie Slides,portraits,residential structures",https://di.lib.vt.edu/files/original/Leonard_J._Currie_s_Slides_Collection/LJC_017_058/LJC_017_058.jpg,,"United States",1,0
2916,https://di.lib.vt.edu/items/show/2916,,,,,"1987-01-01 (photo taken)",,,,,,,,,,,,,,,,,,,,,,,"color slides",,"Blacksburg, Montgomery, Virginia, United States",,,,,,,,,"Virginia Polytechnic Institute and State University. University Libraries^^Virginia Polytechnic Institute and State University. University Libraries. Special Collections Department (Repository)","Estate of Leonard J. Currie","Currie House II","American^^exterior views^^landscape gardening^^residential structures^^entrances^^houses^^Currie House II (Blacksburg)^^Leonard J. Currie Slides^^Currie Projects^^Currie House II (Blacksburg) Completed",,"Currie, Leonard J. (Leonard James), 1913-1996 (Photographer)",,,,"Currie, Leonard J. (Leonard James), 1913-1996 (Architect)",http://rightsstatements.org/vocab/InC-EDU/1.0/,"Virginia Tech Libraries Special Collections^^http://aspace.lib.vt.edu/repositories/2/resources/2315",,,Image,LJC_017_052,,,,,,,,,,,,,,,,,,,,,,,,,,,,,,,,,,,,"American,Currie - Leonard J,Currie House II (Blacksburg),Currie House II (Blacksburg) Completed,Currie Projects,entrances,exterior views,houses,landscape gardening,Leonard J. Currie Slides,residential structures",https://di.lib.vt.edu/files/original/Leonard_J._Currie_s_Slides_Collection/LJC_017_052/LJC_017_052.jpg,,"United States",1,0
2904,https://di.lib.vt.edu/items/show/2904,,,,,"1984-05 (slide developed)",,,,,,,,,,,,,,,,,,,,,,,"color slides",,"Blacksburg, Montgomery, Virginia, United States",,,,,,,,,"Virginia Polytechnic Institute and State University. University Libraries^^Virginia Polytechnic Institute and State University. University Libraries. Special Collections Department (Repository)","Estate of Leonard J. Currie","Currie House II","American^^exterior views^^landscape gardening^^residential structures^^entrances^^houses^^Currie House II (Blacksburg)^^Leonard J. Currie Slides^^Currie Projects^^Currie House II (Blacksburg) Completed",,"Currie, Leonard J. (Leonard James), 1913-1996 (Photographer)",,,,"Currie, Leonard J. (Leonard James), 1913-1996 (Architect)",http://rightsstatements.org/vocab/InC-EDU/1.0/,"Virginia Tech Libraries Special Collections^^http://aspace.lib.vt.edu/repositories/2/resources/2315",,,Image,LJC_017_040,,,,,,,,,,,,,,,,,,,,,,,,,,,,,,,,,,,,"American,Currie - Leonard J,Currie House II (Blacksburg),Currie House II (Blacksburg) Completed,Currie Projects,entrances,exterior views,houses,landscape gardening,Leonard J. Currie Slides,residential structures",https://di.lib.vt.edu/files/original/Leonard_J._Currie_s_Slides_Collection/LJC_017_040/LJC_017_040.jpg,,"United States",1,0
2898,https://di.lib.vt.edu/items/show/2898,,,,,"1982-02 (slide developed)",,,,,,,,,,,,,,,,,,,,,,,"color slides",,"Blacksburg, Montgomery, Virginia, United States",,,,,,,,,"Virginia Polytechnic Institute and State University. University Libraries^^Virginia Polytechnic Institute and State University. University Libraries. Special Collections Department (Repository)","Estate of Leonard J. Currie","Currie House II","American^^residential structures^^houses^^exterior views^^construction (assembling)^^entrances^^Currie House II (Blacksburg) Construction^^Leonard J. Currie Slides^^Currie Projects^^Currie House II (Blacksburg)",,"Currie, Leonard J. (Leonard James), 1913-1996 (Photographer)",,,,"Currie, Leonard J. (Leonard James), 1913-1996 (Architect)",http://rightsstatements.org/vocab/InC-EDU/1.0/,"Virginia Tech Libraries Special Collections^^http://aspace.lib.vt.edu/repositories/2/resources/2315",,,Image,LJC_017_034,,,,,,,,,,,,,,,,,,,,,,,,,,,,,,,,,,,,"American,construction (assembling),Currie - Leonard J,Currie House II (Blacksburg),Currie House II (Blacksburg) Construction,Currie Projects,entrances,exterior views,houses,Leonard J. Currie Slides,residential structures",https://di.lib.vt.edu/files/original/Leonard_J._Currie_s_Slides_Collection/LJC_017_034/LJC_017_034.jpg,,"United States",1,0
2897,https://di.lib.vt.edu/items/show/2897,,,,,"1984-11 (photo taken)",,,,,,,,,,,,,,,,,,,,,,,"color slides",,"Blacksburg, Montgomery, Virginia, United States",,,,,,,,,"Virginia Polytechnic Institute and State University. University Libraries^^Virginia Polytechnic Institute and State University. University Libraries. Special Collections Department (Repository)","Estate of Leonard J. Currie","Currie House II","American^^landscape gardening^^works of art^^residential structures^^entrances^^houses^^Currie House II (Blacksburg)^^Leonard J. Currie Slides^^Currie Projects^^Currie House II (Blacksburg) Completed","Sculpture by Jerald Jacquard through the gate to the right","Currie, Leonard J. (Leonard James), 1913-1996 (Photographer)",,,,"Currie, Leonard J. (Leonard James), 1913-1996 (Architect)^^Jacquard, Jerald, 1937- (Sculptor)",http://rightsstatements.org/vocab/InC-EDU/1.0/,"Virginia Tech Libraries Special Collections^^http://aspace.lib.vt.edu/repositories/2/resources/2315",,,Image,LJC_017_033,,,,,,,,,,,,,,,,,,,,,,,,,,,,,,,,,,,,"American,Currie - Leonard J,Currie House II (Blacksburg),Currie House II (Blacksburg) Completed,Currie Projects,entrances,houses,Jacquard - Jerald,landscape gardening,Leonard J. Currie Slides,residential structures,works of art",https://di.lib.vt.edu/files/original/Leonard_J._Currie_s_Slides_Collection/LJC_017_033/LJC_017_033.jpg,,"United States",1,0