﻿"Item Id","Item URI","Dublin Core:Alternative Title","Dublin Core:Abstract","Dublin Core:Table Of Contents","Dublin Core:Date Available","Dublin Core:Date Created","Dublin Core:Date Accepted","Dublin Core:Date Copyrighted","Dublin Core:Date Submitted","Dublin Core:Date Issued","Dublin Core:Date Modified","Dublin Core:Date Valid","Dublin Core:Access Rights","Dublin Core:License","Dublin Core:Conforms To","Dublin Core:Has Format","Dublin Core:Has Part","Dublin Core:Has Version","Dublin Core:Is Format Of","Dublin Core:Is Part Of","Dublin Core:Is Referenced By","Dublin Core:Is Replaced By","Dublin Core:Is Required By","Dublin Core:Is Version Of","Dublin Core:References","Dublin Core:Replaces","Dublin Core:Requires","Dublin Core:Extent","Dublin Core:Medium","Dublin Core:Bibliographic Citation","Dublin Core:Spatial Coverage","Dublin Core:Temporal Coverage","Dublin Core:Accrual Method","Dublin Core:Accrual Periodicity","Dublin Core:Accrual Policy","Dublin Core:Audience","Dublin Core:Audience Education Level","Dublin Core:Mediator","Dublin Core:Instructional Method","Dublin Core:Provenance","Dublin Core:Rights Holder","Dublin Core:Title","Dublin Core:Subject","Dublin Core:Description","Dublin Core:Creator","Dublin Core:Source","Dublin Core:Publisher","Dublin Core:Date","Dublin Core:Contributor","Dublin Core:Rights","Dublin Core:Relation","Dublin Core:Format","Dublin Core:Language","Dublin Core:Type","Dublin Core:Identifier","Dublin Core:Coverage","Item Type Metadata:Text","Item Type Metadata:Interviewer","Item Type Metadata:Interviewee","Item Type Metadata:Location","Item Type Metadata:Transcription","Item Type Metadata:Local URL","Item Type Metadata:Original Format","Item Type Metadata:Physical Dimensions","Item Type Metadata:Duration","Item Type Metadata:Compression","Item Type Metadata:Producer","Item Type Metadata:Director","Item Type Metadata:Bit Rate/Frequency","Item Type Metadata:Time Summary","Item Type Metadata:Email Body","Item Type Metadata:Subject Line","Item Type Metadata:From","Item Type Metadata:To","Item Type Metadata:CC","Item Type Metadata:BCC","Item Type Metadata:Number of Attachments","Item Type Metadata:Standards","Item Type Metadata:Objectives","Item Type Metadata:Materials","Item Type Metadata:Lesson Plan Text","Item Type Metadata:URL","Item Type Metadata:Event Type","Item Type Metadata:Participants","Item Type Metadata:Birth Date","Item Type Metadata:Birthplace","Item Type Metadata:Death Date","Item Type Metadata:Occupation","Item Type Metadata:Biographical Text","Item Type Metadata:Bibliography",tags,file,itemType,collection,public,featured
348,https://di.lib.vt.edu/items/show/348,,,,,,,,,,,,,,,,,,,"Squires Theatre Posters",,,,,,,,,posters,,"Blacksburg, Montgomery county, Virginia, United States",,,,,,,,,"Virginia Polytechnic Institute and State University. University Libraries",,"Fall Days and Starlit Nights Homecoming Dance 1984",Theater^^Virginia,"Production poster for Fall Days and Starlit Nights Homecoming Dance 1984 featuring the Maxx, Junior Cline and the Recliners","Butterfield, Tom (Poster artist)",,,,"Virginia Polytechnic Institute and State University. Theatre Arts - University Theatre",http://rightsstatements.org/vocab/InC-EDU/1.0/,,image/jpeg,eng,Image,SQI_PO_00247,,,,,,,,,,,,,,,,,,,,,,,,,,,,,,,,,,,,,https://di.lib.vt.edu/files/original/2/SQI_PO_00247/SQI_PO_00247_001.jpg,,"Squires Theatre Posters",1,0
62,https://di.lib.vt.edu/items/show/62,,,,,,,,,,,,,,,,,,,"Squires Theatre Posters",,,,,,,,,posters,,"Blacksburg, Montgomery county, Virginia, United States",,,,,,,,,"Virginia Polytechnic Institute and State University. University Libraries",,"Gala New Musical Frog Review",Theater^^Virginia,"Production poster for Gala New Musical Frog Review.","Jones, Charles, M.",,,1974-03-07/1974-03-09,"Virginia Polytechnic Institute and State University. Theatre Arts - University Theatre^^Virginia Polytechnic Institute and State University. Department of Performing Arts and Communications",http://rightsstatements.org/vocab/InC-EDU/1.0/,,image/jpeg,eng,Image,SQI_PO_00058,,,,,,,,,,,,,,,,,,,,,,,,,,,,,,,,,,,,"Theater,Virginia",https://di.lib.vt.edu/files/original/2/SQI_PO_00058/SQI_PO_00058_001.jpg,,"Squires Theatre Posters",1,0
71,https://di.lib.vt.edu/items/show/71,,,,,,,,,,,,,,,,,,,"Squires Theatre Posters",,,,,,,,,posters,,"Blacksburg, Montgomery county, Virginia, United States",,,,,,,,,"Virginia Polytechnic Institute and State University. University Libraries",,"Dames at Sea",Theater^^Virginia,"Production poster for Dames at Sea.","Wills, George",,,,"Virginia Polytechnic Institute and State University. Theatre Arts - University Theatre",http://rightsstatements.org/vocab/InC-EDU/1.0/,,image/jpeg,eng,Image,SQI_PO_00069,,,,,,,,,,,,,,,,,,,,,,,,,,,,,,,,,,,,"Theater,Virginia",https://di.lib.vt.edu/files/original/2/SQI_PO_00069/SQI_PO_00069_001.jpg,,"Squires Theatre Posters",1,0
7,https://di.lib.vt.edu/items/show/7,,,,,,,,,,,,,,,,,,,"Squires Theatre Posters",,,,,,,,,posters,,"Blacksburg, Montgomery county, Virginia, United States",,,,,,,,,"Virginia Polytechnic Institute and State University. University Libraries",,"Prime of Miss Jean Brodie by Jay Presson Allen",Theater^^Virginia,"Production poster for Prime of Miss Jean Brodie by Jay Presson Allen.",,,,,"Virginia Polytechnic Institute and State University. Theatre Arts - University Theatre",http://rightsstatements.org/vocab/InC-EDU/1.0/,,image/jpeg,eng,Image,SQI_PO_00001,,,,,,,,,,,,,,,,,,,,,,,,,,,,,,,,,,,,"Theater,Virginia",https://di.lib.vt.edu/files/original/2/SQI_PO_00001/SQI_PO_00001_001.jpg,,"Squires Theatre Posters",1,0
8,https://di.lib.vt.edu/items/show/8,,,,,,,,,,,,,,,,,,,"Squires Theatre Posters",,,,,,,,,posters,,"Blacksburg, Montgomery county, Virginia, United States",,,,,,,,,"Virginia Polytechnic Institute and State University. University Libraries",,"Hawkfortune by Philip A. Bosakowski",Theater^^Virginia,"Production poster for Hawkfortune by Philip A. Bosakowski.",,,,,"Virginia Polytechnic Institute and State University. Theatre Arts - University Theatre^^Virginia Polytechnic Institute and State University. Department of Performing Arts and Communications",http://rightsstatements.org/vocab/InC-EDU/1.0/,,image/jpeg,eng,Image,SQI_PO_00002,,,,,,,,,,,,,,,,,,,,,,,,,,,,,,,,,,,,"Theater,Virginia",https://di.lib.vt.edu/files/original/2/SQI_PO_00002/SQI_PO_00002_001.jpg,,"Squires Theatre Posters",1,0
9,https://di.lib.vt.edu/items/show/9,,,,,,,,,,,,,,,,,,,"Squires Theatre Posters",,,,,,,,,posters,,"Blacksburg, Montgomery county, Virginia, United States",,,,,,,,,"Virginia Polytechnic Institute and State University. University Libraries",,"Mirkwood Marionettes",Theater^^Virginia,"Production poster for Mirkwood Marionettes.",,,,,"Maroon Mask^^American Association of University Women",http://rightsstatements.org/vocab/InC-EDU/1.0/,,image/jpeg,eng,Image,SQI_PO_00003,,,,,,,,,,,,,,,,,,,,,,,,,,,,,,,,,,,,"Theater,Virginia",https://di.lib.vt.edu/files/original/2/SQI_PO_00003/SQI_PO_00003_001.jpg,,"Squires Theatre Posters",1,0
10,https://di.lib.vt.edu/items/show/10,,,,,,,,,,,,,,,,,,,"Squires Theatre Posters",,,,,,,,,posters,,"Blacksburg, Montgomery county, Virginia, United States",,,,,,,,,"Virginia Polytechnic Institute and State University. University Libraries",,Gypsy,Theater^^Virginia,"Production poster for Gypsy.",,,,,"Virginia Polytechnic Institute and State University. Theatre Arts - University Theatre",http://rightsstatements.org/vocab/InC-EDU/1.0/,,image/jpeg,eng,Image,SQI_PO_00004,,,,,,,,,,,,,,,,,,,,,,,,,,,,,,,,,,,,"Theater,Virginia",https://di.lib.vt.edu/files/original/2/SQI_PO_00004/SQI_PO_00004_001.jpg,,"Squires Theatre Posters",1,0
11,https://di.lib.vt.edu/items/show/11,,,,,,,,,,,,,,,,,,,"Squires Theatre Posters",,,,,,,,,posters,,"Blacksburg, Montgomery county, Virginia, United States",,,,,,,,,"Virginia Polytechnic Institute and State University. University Libraries",,"Thurber Carnival",Theater^^Virginia,"Production poster for Thurber Carnival.",,,,,"Maroon Mask",http://rightsstatements.org/vocab/InC-EDU/1.0/,,image/jpeg,eng,Image,SQI_PO_00005,,,,,,,,,,,,,,,,,,,,,,,,,,,,,,,,,,,,"Theater,Virginia",https://di.lib.vt.edu/files/original/2/SQI_PO_00005/SQI_PO_00005_001.jpg,,"Squires Theatre Posters",1,0
12,https://di.lib.vt.edu/items/show/12,,,,,,,,,,,,,,,,,,,"Squires Theatre Posters",,,,,,,,,posters,,"Blacksburg, Montgomery county, Virginia, United States",,,,,,,,,"Virginia Polytechnic Institute and State University. University Libraries",,"Commedia Dell' Arte",Theater^^Virginia,"Production poster for Commedia Dell' Arte.",,,,,"Virginia Polytechnic Institute and State University. Theatre Arts - University Theatre",http://rightsstatements.org/vocab/InC-EDU/1.0/,,image/jpeg,eng,Image,SQI_PO_00006,,,,,,,,,,,,,,,,,,,,,,,,,,,,,,,,,,,,"Theater,Virginia",https://di.lib.vt.edu/files/original/2/SQI_PO_00006/SQI_PO_00006_001.jpg,,"Squires Theatre Posters",1,0
13,https://di.lib.vt.edu/items/show/13,,,,,,,,,,,,,,,,,,,"Squires Theatre Posters",,,,,,,,,posters,,"Blacksburg, Montgomery county, Virginia, United States",,,,,,,,,"Virginia Polytechnic Institute and State University. University Libraries",,"Ring Round the Moon by Jean Anouilh",Theater^^Virginia,"Production poster for Ring Round the Moon by Jean Anouilh.",,,,,"Virginia Polytechnic Institute and State University. Theatre Arts - University Theatre^^Virginia Polytechnic Institute and State University. Department of Performing Arts and Communications",http://rightsstatements.org/vocab/InC-EDU/1.0/,,image/jpeg,eng,Image,SQI_PO_00007,,,,,,,,,,,,,,,,,,,,,,,,,,,,,,,,,,,,"Theater,Virginia",https://di.lib.vt.edu/files/original/2/SQI_PO_00007/SQI_PO_00007_001.jpg,,"Squires Theatre Posters",1,0
14,https://di.lib.vt.edu/items/show/14,,,,,,,,,,,,,,,,,,,"Squires Theatre Posters",,,,,,,,,posters,,"Blacksburg, Montgomery county, Virginia, United States",,,,,,,,,"Virginia Polytechnic Institute and State University. University Libraries",,"Step on a Crack by Suzan Zeder",Theater^^Virginia,"Production poster for Step on a Crack by Suzan Zeder.",,,,,"Virginia Polytechnic Institute and State University. Theatre Arts - University Theatre",http://rightsstatements.org/vocab/InC-EDU/1.0/,,image/jpeg,eng,Image,SQI_PO_00008,,,,,,,,,,,,,,,,,,,,,,,,,,,,,,,,,,,,"Theater,Virginia",https://di.lib.vt.edu/files/original/2/SQI_PO_00008/SQI_PO_00008_001.jpg,,"Squires Theatre Posters",1,0
15,https://di.lib.vt.edu/items/show/15,,,,,,,,,,,,,,,,,,,"Squires Theatre Posters",,,,,,,,,posters,,"Blacksburg, Montgomery county, Virginia, United States",,,,,,,,,"Virginia Polytechnic Institute and State University. University Libraries",,"Boy Friend",Theater^^Virginia,"Production poster for Boy Friend.",,,,,"Virginia Polytechnic Institute and State University. Theatre Arts - University Theatre^^Music Theatre International",http://rightsstatements.org/vocab/InC-EDU/1.0/,,image/jpeg,eng,Image,SQI_PO_00009,,,,,,,,,,,,,,,,,,,,,,,,,,,,,,,,,,,,"Theater,Virginia",https://di.lib.vt.edu/files/original/2/SQI_PO_00009/SQI_PO_00009_001.jpg,,"Squires Theatre Posters",1,0
16,https://di.lib.vt.edu/items/show/16,,,,,,,,,,,,,,,,,,,"Squires Theatre Posters",,,,,,,,,posters,,"Blacksburg, Montgomery county, Virginia, United States",,,,,,,,,"Virginia Polytechnic Institute and State University. University Libraries",,"No Exit and Tiny Darkness",Theater^^Virginia,"Production poster for No Exit and Tiny Darkness.",,,,,"Virginia Polytechnic Institute and State University. Theatre Arts - University Theatre",http://rightsstatements.org/vocab/InC-EDU/1.0/,,image/jpeg,eng,Image,SQI_PO_00010,,,,,,,,,,,,,,,,,,,,,,,,,,,,,,,,,,,,"Theater,Virginia",https://di.lib.vt.edu/files/original/2/SQI_PO_00010/SQI_PO_00010_001.jpg,,"Squires Theatre Posters",1,0
17,https://di.lib.vt.edu/items/show/17,,,,,,,,,,,,,,,,,,,"Squires Theatre Posters",,,,,,,,,posters,,"Blacksburg, Montgomery county, Virginia, United States",,,,,,,,,"Virginia Polytechnic Institute and State University. University Libraries",,"Woyzeck by Georg Buchner",Theater^^Virginia,"Production poster for Woyzeck by Georg Buchner.",,,,,"Virginia Polytechnic Institute and State University. Theatre Arts - University Theatre^^Virginia Polytechnic Institute and State University. Department of Performing Arts and Communications",http://rightsstatements.org/vocab/InC-EDU/1.0/,,image/jpeg,eng,Image,SQI_PO_00011,,,,,,,,,,,,,,,,,,,,,,,,,,,,,,,,,,,,"Theater,Virginia",https://di.lib.vt.edu/files/original/2/SQI_PO_00011/SQI_PO_00011_001.jpg,,"Squires Theatre Posters",1,0
18,https://di.lib.vt.edu/items/show/18,,,,,,,,,,,,,,,,,,,"Squires Theatre Posters",,,,,,,,,posters,,"Blacksburg, Montgomery county, Virginia, United States",,,,,,,,,"Virginia Polytechnic Institute and State University. University Libraries",,"Misanthrope by Moliere",Theater^^Virginia,"Production poster for Misanthrope by Moliere.",,,,,"Virginia Polytechnic Institute and State University. Theatre Arts - University Theatre",http://rightsstatements.org/vocab/InC-EDU/1.0/,,image/jpeg,eng,Image,SQI_PO_00012,,,,,,,,,,,,,,,,,,,,,,,,,,,,,,,,,,,,"Theater,Virginia",https://di.lib.vt.edu/files/original/2/SQI_PO_00012/SQI_PO_00012_001.jpg,,"Squires Theatre Posters",1,0
19,https://di.lib.vt.edu/items/show/19,,,,,,,,,,,,,,,,,,,"Squires Theatre Posters",,,,,,,,,posters,,"Blacksburg, Montgomery county, Virginia, United States",,,,,,,,,"Virginia Polytechnic Institute and State University. University Libraries",,"New River Valley Symphony 1993",Concerts^^Virginia,"Production poster for New River Valley Symphony. Programs include Water Music | Horn Concerto No. 1 | Concertpiece for Four Horns, Op. 68 | Finale, Symphony No. 1, D major (""Titan"")",,,,1993-02-27,,http://rightsstatements.org/vocab/InC-EDU/1.0/,,image/jpeg,,Image,SQI_PO_00013,,,,,,,,,,,,,,,,,,,,,,,,,,,,,,,,,,,,"Concerts,Virginia",https://di.lib.vt.edu/files/original/2/SQI_PO_00013/SQI_PO_00013_001.jpg,,"Squires Theatre Posters",1,0
20,https://di.lib.vt.edu/items/show/20,,,,,,,,,,,,,,,,,,,"Squires Theatre Posters",,,,,,,,,posters,,"Blacksburg, Montgomery county, Virginia, United States",,,,,,,,,"Virginia Polytechnic Institute and State University. University Libraries",,"New River Valley Symphony 1983-84 Season",Concerts^^Virginia,"Production poster for New River Valley Symphony 1983-84 Season. Programs: ""Prometheus"" Overture| Violin Concerto No. 3 | Rosenkavalier Waltzes | Hary Janos Suite | ""Rienzi"" Overture | Symphonic Variations | Symphony No. 104 | Requiem Mass | Concerto Grosso, Op. 6 No. 4 | Songs of a Wayfarer | Pictures at an Exhibition",,,,1983/1984,"Virginia Polytechnic Institute and State University. Department of Music",http://rightsstatements.org/vocab/InC-EDU/1.0/,,image/jpeg,,Image,SQI_PO_00014,,,,,,,,,,,,,,,,,,,,,,,,,,,,,,,,,,,,"Concerts,Virginia",https://di.lib.vt.edu/files/original/2/SQI_PO_00014/SQI_PO_00014_001.jpg,,"Squires Theatre Posters",1,0
21,https://di.lib.vt.edu/items/show/21,,,,,,,,,,,,,,,,,,,"Squires Theatre Posters",,,,,,,,,posters,,"Blacksburg, Montgomery county, Virginia, United States",,,,,,,,,"Virginia Polytechnic Institute and State University. University Libraries",,"Tooth of Crime by Sam Shepard",Theater^^Virginia,"Production poster for Tooth of Crime by Sam Shepard.",,,,,"Virginia Polytechnic Institute and State University. Theatre Arts - University Theatre^^Virginia Polytechnic Institute and State University. Department of Performing Arts and Communications",http://rightsstatements.org/vocab/InC-EDU/1.0/,,image/jpeg,eng,Image,SQI_PO_00015,,,,,,,,,,,,,,,,,,,,,,,,,,,,,,,,,,,,"Theater,Virginia",https://di.lib.vt.edu/files/original/2/SQI_PO_00015/SQI_PO_00015_001.jpg,,"Squires Theatre Posters",1,0
22,https://di.lib.vt.edu/items/show/22,,,,,,,,,,,,,,,,,,,"Squires Theatre Posters",,,,,,,,,posters,,"Blacksburg, Montgomery county, Virginia, United States",,,,,,,,,"Virginia Polytechnic Institute and State University. University Libraries",,"Look Homeward, Angel by Thomas Wolfe",Theater^^Virginia,"Production poster for Look Homeward, Angel.",,,,,"Virginia Polytechnic Institute and State University. Theatre Arts - University Theatre",http://rightsstatements.org/vocab/InC-EDU/1.0/,,image/jpeg,eng,Image,SQI_PO_00016,,,,,,,,,,,,,,,,,,,,,,,,,,,,,,,,,,,,"Theater,Virginia",https://di.lib.vt.edu/files/original/2/SQI_PO_00016/SQI_PO_00016_001.jpg,,"Squires Theatre Posters",1,0
23,https://di.lib.vt.edu/items/show/23,,,,,,,,,,,,,,,,,,,"Squires Theatre Posters",,,,,,,,,posters,,"Blacksburg, Montgomery county, Virginia, United States",,,,,,,,,"Virginia Polytechnic Institute and State University. University Libraries",,"World at January",Theater^^Virginia,"Production poster for World at January.",,,,,"Virginia Polytechnic Institute and State University. Theatre Arts - University Theatre",http://rightsstatements.org/vocab/InC-EDU/1.0/,,image/jpeg,eng,Image,SQI_PO_00017,,,,,,,,,,,,,,,,,,,,,,,,,,,,,,,,,,,,"Theater,Virginia",https://di.lib.vt.edu/files/original/2/SQI_PO_00017/SQI_PO_00017_001.jpg,,"Squires Theatre Posters",1,0
