﻿"Item Id","Item URI","Dublin Core:Alternative Title","Dublin Core:Abstract","Dublin Core:Table Of Contents","Dublin Core:Date Available","Dublin Core:Date Created","Dublin Core:Date Accepted","Dublin Core:Date Copyrighted","Dublin Core:Date Submitted","Dublin Core:Date Issued","Dublin Core:Date Modified","Dublin Core:Date Valid","Dublin Core:Access Rights","Dublin Core:License","Dublin Core:Conforms To","Dublin Core:Has Format","Dublin Core:Has Part","Dublin Core:Has Version","Dublin Core:Is Format Of","Dublin Core:Is Part Of","Dublin Core:Is Referenced By","Dublin Core:Is Replaced By","Dublin Core:Is Required By","Dublin Core:Is Version Of","Dublin Core:References","Dublin Core:Replaces","Dublin Core:Requires","Dublin Core:Extent","Dublin Core:Medium","Dublin Core:Bibliographic Citation","Dublin Core:Spatial Coverage","Dublin Core:Temporal Coverage","Dublin Core:Accrual Method","Dublin Core:Accrual Periodicity","Dublin Core:Accrual Policy","Dublin Core:Audience","Dublin Core:Audience Education Level","Dublin Core:Mediator","Dublin Core:Instructional Method","Dublin Core:Provenance","Dublin Core:Rights Holder","Dublin Core:Title","Dublin Core:Subject","Dublin Core:Description","Dublin Core:Creator","Dublin Core:Source","Dublin Core:Publisher","Dublin Core:Date","Dublin Core:Contributor","Dublin Core:Rights","Dublin Core:Relation","Dublin Core:Format","Dublin Core:Language","Dublin Core:Type","Dublin Core:Identifier","Dublin Core:Coverage","Item Type Metadata:Text","Item Type Metadata:Interviewer","Item Type Metadata:Interviewee","Item Type Metadata:Location","Item Type Metadata:Transcription","Item Type Metadata:Local URL","Item Type Metadata:Original Format","Item Type Metadata:Physical Dimensions","Item Type Metadata:Duration","Item Type Metadata:Compression","Item Type Metadata:Producer","Item Type Metadata:Director","Item Type Metadata:Bit Rate/Frequency","Item Type Metadata:Time Summary","Item Type Metadata:Email Body","Item Type Metadata:Subject Line","Item Type Metadata:From","Item Type Metadata:To","Item Type Metadata:CC","Item Type Metadata:BCC","Item Type Metadata:Number of Attachments","Item Type Metadata:Standards","Item Type Metadata:Objectives","Item Type Metadata:Materials","Item Type Metadata:Lesson Plan Text","Item Type Metadata:URL","Item Type Metadata:Event Type","Item Type Metadata:Participants","Item Type Metadata:Birth Date","Item Type Metadata:Birthplace","Item Type Metadata:Death Date","Item Type Metadata:Occupation","Item Type Metadata:Biographical Text","Item Type Metadata:Bibliography",tags,file,itemType,collection,public,featured
3101,https://di.lib.vt.edu/items/show/3101,,,,,"1961 (photo taken)",,,,,,,,,,,,,,,,,,,,,,,"color slides",,"Blacksburg, Montgomery, Virginia, United States",,,,,,,,,"Virginia Polytechnic Institute and State University. University Libraries^^Virginia Polytechnic Institute and State University. University Libraries. Special Collections Department (Repository)","Estate of Leonard J. Currie","Bradley House","American^^exterior views^^landscape gardening^^residential structures^^houses^^Leonard J. Currie Slides^^Currie Projects^^Bradley House",,"Currie, Leonard J. (Leonard James), 1913-1996 (Photographer)",,,,"Currie, Leonard J. (Leonard James), 1913-1996 (Architect)",http://rightsstatements.org/vocab/InC-EDU/1.0/,"Virginia Tech Libraries Special Collections^^http://aspace.lib.vt.edu/repositories/2/resources/2315",,,Image,LJC_127_004,,,,,,,,,,,,,,,,,,,,,,,,,,,,,,,,,,,,"American,Bradley House,Currie - Leonard J,Currie Projects,exterior views,houses,landscape gardening,Leonard J. Currie Slides,residential structures",https://di.lib.vt.edu/files/original/Leonard_J._Currie_s_Slides_Collection/LJC_127_004/LJC_127_004.jpg,,"United States",1,0
3102,https://di.lib.vt.edu/items/show/3102,,,,,"1960 (photo taken)",,,,,,,,,,,,,,,,,,,,,,,"color slides",,"Blacksburg, Montgomery, Virginia, United States",,,,,,,,,"Virginia Polytechnic Institute and State University. University Libraries^^Virginia Polytechnic Institute and State University. University Libraries. Special Collections Department (Repository)","Estate of Leonard J. Currie","Bradley House","American^^construction (assembling)^^residential structures^^houses^^Leonard J. Currie Slides^^Currie Projects^^Bradley House",,"Currie, Leonard J. (Leonard James), 1913-1996 (Photographer)",,,,"Currie, Leonard J. (Leonard James), 1913-1996 (Architect)",http://rightsstatements.org/vocab/InC-EDU/1.0/,"Virginia Tech Libraries Special Collections^^http://aspace.lib.vt.edu/repositories/2/resources/2315",,,Image,LJC_127_005,,,,,,,,,,,,,,,,,,,,,,,,,,,,,,,,,,,,"American,Bradley House,construction (assembling),Currie - Leonard J,Currie Projects,houses,Leonard J. Currie Slides,residential structures",https://di.lib.vt.edu/files/original/Leonard_J._Currie_s_Slides_Collection/LJC_127_005/LJC_127_005.jpg,,"United States",1,0
587,https://di.lib.vt.edu/items/show/587,,,,,"1977-12 (photo taken)",,,,,,,,,,,,,,"Leonard J. Currie Slides",,,,,,,,,"color slides",,"Bogotá, Bogotá, Distrito Capital de, Colombia",,,,,,,,,"Virginia Polytechnic Institute and State University. University Libraries^^Virginia Polytechnic Institute and State University. University Libraries. Special Collections Department (Repository)","Estate of Leonard J. Currie","Brick Apartment Building, Bogotá","Colombian^^exterior views^^residential structures^^apartment houses^^Leonard J. Currie Slides^^South America^^Colombia",,"Currie, Leonard J. (Leonard James), 1913-1996 (Photographer)",,,,,http://rightsstatements.org/vocab/InC-EDU/1.0/,"Virginia Tech Libraries Special Collections^^http://aspace.lib.vt.edu/repositories/2/resources/2315",,,Image,LJC_087_080,,,,,,,,,,,,,,,,,,,,,,,,,,,,,,,,,,,,"apartment houses,Colombia,Currie - Leonard J,exterior views,Leonard J. Currie Slides,residential structures,South America",https://di.lib.vt.edu/files/original/Leonard_J._Currie_s_Slides_Collection/LJC_087_080/LJC_087_080.jpg,,Colombia,1,0
588,https://di.lib.vt.edu/items/show/588,,,,,"1977-12 (photo taken)",,,,,,,,,,,,,,"Leonard J. Currie Slides",,,,,,,,,"color slides",,"Bogotá, Bogotá, Distrito Capital de, Colombia",,,,,,,,,"Virginia Polytechnic Institute and State University. University Libraries^^Virginia Polytechnic Institute and State University. University Libraries. Special Collections Department (Repository)","Estate of Leonard J. Currie","Brick Apartment Building, Bogotá","Colombian^^exterior views^^residential structures^^apartment houses^^Leonard J. Currie Slides^^South America^^Colombia",,"Currie, Leonard J. (Leonard James), 1913-1996 (Photographer)",,,,,http://rightsstatements.org/vocab/InC-EDU/1.0/,"Virginia Tech Libraries Special Collections^^http://aspace.lib.vt.edu/repositories/2/resources/2315",,,Image,LJC_087_081,,,,,,,,,,,,,,,,,,,,,,,,,,,,,,,,,,,,"apartment houses,Colombia,Currie - Leonard J,exterior views,Leonard J. Currie Slides,residential structures,South America",https://di.lib.vt.edu/files/original/Leonard_J._Currie_s_Slides_Collection/LJC_087_081/LJC_087_081.jpg,,Colombia,1,0
589,https://di.lib.vt.edu/items/show/589,,,,,"1977-12 (photo taken)",,,,,,,,,,,,,,"Leonard J. Currie Slides",,,,,,,,,"color slides",,"Bogotá, Bogotá, Distrito Capital de, Colombia",,,,,,,,,"Virginia Polytechnic Institute and State University. University Libraries^^Virginia Polytechnic Institute and State University. University Libraries. Special Collections Department (Repository)","Estate of Leonard J. Currie","Brick Apartment Building, Bogotá","Colombian^^exterior views^^residential structures^^apartment houses^^Leonard J. Currie Slides^^South America^^Colombia",,"Currie, Leonard J. (Leonard James), 1913-1996 (Photographer)",,,,,http://rightsstatements.org/vocab/InC-EDU/1.0/,"Virginia Tech Libraries Special Collections^^http://aspace.lib.vt.edu/repositories/2/resources/2315",,,Image,LJC_087_082,,,,,,,,,,,,,,,,,,,,,,,,,,,,,,,,,,,,"apartment houses,Colombia,Currie - Leonard J,exterior views,Leonard J. Currie Slides,residential structures,South America",https://di.lib.vt.edu/files/original/Leonard_J._Currie_s_Slides_Collection/LJC_087_082/LJC_087_082.jpg,,Colombia,1,0
590,https://di.lib.vt.edu/items/show/590,,,,,"1977-12 (photo taken)",,,,,,,,,,,,,,"Leonard J. Currie Slides",,,,,,,,,"color slides",,"Bogotá, Bogotá, Distrito Capital de, Colombia",,,,,,,,,"Virginia Polytechnic Institute and State University. University Libraries^^Virginia Polytechnic Institute and State University. University Libraries. Special Collections Department (Repository)","Estate of Leonard J. Currie","Brick Apartment Building, Bogotá","Colombian^^exterior views^^residential structures^^apartment houses^^Leonard J. Currie Slides^^South America^^Colombia",,"Currie, Leonard J. (Leonard James), 1913-1996 (Photographer)",,,,,http://rightsstatements.org/vocab/InC-EDU/1.0/,"Virginia Tech Libraries Special Collections^^http://aspace.lib.vt.edu/repositories/2/resources/2315",,,Image,LJC_087_083,,,,,,,,,,,,,,,,,,,,,,,,,,,,,,,,,,,,"apartment houses,Colombia,Currie - Leonard J,exterior views,Leonard J. Currie Slides,residential structures,South America",https://di.lib.vt.edu/files/original/Leonard_J._Currie_s_Slides_Collection/LJC_087_083/LJC_087_083.jpg,,Colombia,1,0
591,https://di.lib.vt.edu/items/show/591,,,,,"1977-12 (photo taken)",,,,,,,,,,,,,,"Leonard J. Currie Slides",,,,,,,,,"color slides",,"Bogotá, Bogotá, Distrito Capital de, Colombia",,,,,,,,,"Virginia Polytechnic Institute and State University. University Libraries^^Virginia Polytechnic Institute and State University. University Libraries. Special Collections Department (Repository)","Estate of Leonard J. Currie","Brick Apartment Buildings, Bogotá","Colombian^^exterior views^^residential structures^^apartment houses^^streets^^Leonard J. Currie Slides^^South America^^Colombia",,"Currie, Leonard J. (Leonard James), 1913-1996 (Photographer)",,,,,http://rightsstatements.org/vocab/InC-EDU/1.0/,"Virginia Tech Libraries Special Collections^^http://aspace.lib.vt.edu/repositories/2/resources/2315",,,Image,LJC_087_084,,,,,,,,,,,,,,,,,,,,,,,,,,,,,,,,,,,,"apartment houses,Colombia,Currie - Leonard J,exterior views,Leonard J. Currie Slides,residential structures,South America,streets",https://di.lib.vt.edu/files/original/Leonard_J._Currie_s_Slides_Collection/LJC_087_084/LJC_087_084.jpg,,Colombia,1,0
592,https://di.lib.vt.edu/items/show/592,,,,,"1977-12 (photo taken)",,,,,,,,,,,,,,"Leonard J. Currie Slides",,,,,,,,,"color slides",,"Bogotá, Bogotá, Distrito Capital de, Colombia",,,,,,,,,"Virginia Polytechnic Institute and State University. University Libraries^^Virginia Polytechnic Institute and State University. University Libraries. Special Collections Department (Repository)","Estate of Leonard J. Currie","Brick Apartment Buildings, Bogotá","Colombian^^exterior views^^residential structures^^apartment houses^^Leonard J. Currie Slides^^South America^^Colombia",,"Currie, Leonard J. (Leonard James), 1913-1996 (Photographer)",,,,,http://rightsstatements.org/vocab/InC-EDU/1.0/,"Virginia Tech Libraries Special Collections^^http://aspace.lib.vt.edu/repositories/2/resources/2315",,,Image,LJC_087_085,,,,,,,,,,,,,,,,,,,,,,,,,,,,,,,,,,,,"apartment houses,Colombia,Currie - Leonard J,exterior views,Leonard J. Currie Slides,residential structures,South America",https://di.lib.vt.edu/files/original/Leonard_J._Currie_s_Slides_Collection/LJC_087_085/LJC_087_085.jpg,,Colombia,1,0
593,https://di.lib.vt.edu/items/show/593,,,,,"1977-12 (photo taken)",,,,,,,,,,,,,,"Leonard J. Currie Slides",,,,,,,,,"color slides",,"Bogotá, Bogotá, Distrito Capital de, Colombia",,,,,,,,,"Virginia Polytechnic Institute and State University. University Libraries^^Virginia Polytechnic Institute and State University. University Libraries. Special Collections Department (Repository)","Estate of Leonard J. Currie","Brick Apartment Buildings, Bogotá","Colombian^^exterior views^^residential structures^^apartment houses^^Leonard J. Currie Slides^^South America^^Colombia",,"Currie, Leonard J. (Leonard James), 1913-1996 (Photographer)",,,,,http://rightsstatements.org/vocab/InC-EDU/1.0/,"Virginia Tech Libraries Special Collections^^http://aspace.lib.vt.edu/repositories/2/resources/2315",,,Image,LJC_087_086,,,,,,,,,,,,,,,,,,,,,,,,,,,,,,,,,,,,"apartment houses,Colombia,Currie - Leonard J,exterior views,Leonard J. Currie Slides,residential structures,South America",https://di.lib.vt.edu/files/original/Leonard_J._Currie_s_Slides_Collection/LJC_087_086/LJC_087_086.jpg,,Colombia,1,0
594,https://di.lib.vt.edu/items/show/594,,,,,"1977-12 (photo taken)",,,,,,,,,,,,,,"Leonard J. Currie Slides",,,,,,,,,"color slides",,"Bogotá, Bogotá, Distrito Capital de, Colombia",,,,,,,,,"Virginia Polytechnic Institute and State University. University Libraries^^Virginia Polytechnic Institute and State University. University Libraries. Special Collections Department (Repository)","Estate of Leonard J. Currie","Brick Apartment Buildings, Bogotá","Colombian^^exterior views^^residential structures^^apartment houses^^Leonard J. Currie Slides^^South America^^Colombia",,"Currie, Leonard J. (Leonard James), 1913-1996 (Photographer)",,,,,http://rightsstatements.org/vocab/InC-EDU/1.0/,"Virginia Tech Libraries Special Collections^^http://aspace.lib.vt.edu/repositories/2/resources/2315",,,Image,LJC_087_087,,,,,,,,,,,,,,,,,,,,,,,,,,,,,,,,,,,,"apartment houses,Colombia,Currie - Leonard J,exterior views,Leonard J. Currie Slides,residential structures,South America",https://di.lib.vt.edu/files/original/Leonard_J._Currie_s_Slides_Collection/LJC_087_087/LJC_087_087.jpg,,Colombia,1,0
595,https://di.lib.vt.edu/items/show/595,,,,,"1977-12 (photo taken)",,,,,,,,,,,,,,"Leonard J. Currie Slides",,,,,,,,,"color slides",,"Bogotá, Bogotá, Distrito Capital de, Colombia",,,,,,,,,"Virginia Polytechnic Institute and State University. University Libraries^^Virginia Polytechnic Institute and State University. University Libraries. Special Collections Department (Repository)","Estate of Leonard J. Currie","Brick Apartment Buildings, Bogotá","Colombian^^exterior views^^residential structures^^apartment houses^^Leonard J. Currie Slides^^South America^^Colombia",,"Currie, Leonard J. (Leonard James), 1913-1996 (Photographer)",,,,,http://rightsstatements.org/vocab/InC-EDU/1.0/,"Virginia Tech Libraries Special Collections^^http://aspace.lib.vt.edu/repositories/2/resources/2315",,,Image,LJC_087_088,,,,,,,,,,,,,,,,,,,,,,,,,,,,,,,,,,,,"apartment houses,Colombia,Currie - Leonard J,exterior views,Leonard J. Currie Slides,residential structures,South America",https://di.lib.vt.edu/files/original/Leonard_J._Currie_s_Slides_Collection/LJC_087_088/LJC_087_088.jpg,,Colombia,1,0
2147,https://di.lib.vt.edu/items/show/2147,,,,,"1951-08-31 (photo taken)",,,,,,,,,,,,,,,,,,,,,,,"color slides",,"Liberia, Guanacaste, Costa Rica",,,,,,,,,"Virginia Polytechnic Institute and State University. University Libraries^^Virginia Polytechnic Institute and State University. University Libraries. Special Collections Department (Repository)","Estate of Leonard J. Currie","Building brick kiln for public works department, Liberia, Costa Rica","Costa Rican^^ceramics (object genre)^^construction (assembling)^^Leonard J. Currie Slides^^Costa Rica",,"Currie, Leonard J. (Leonard James), 1913-1996 (Photographer)",,,,,http://rightsstatements.org/vocab/InC-EDU/1.0/,"Virginia Tech Libraries Special Collections^^http://aspace.lib.vt.edu/repositories/2/resources/2315",,,Image,LJC_086_007,,,,,,,,,,,,,,,,,,,,,,,,,,,,,,,,,,,,"ceramics (object genre),construction (assembling),Costa Rica,Costa Rican,Currie - Leonard J,Leonard J. Currie Slides",https://di.lib.vt.edu/files/original/Leonard_J._Currie_s_Slides_Collection/LJC_086_007/LJC_086_007.jpg,,"Central America",1,0
2949,https://di.lib.vt.edu/items/show/2949,,,,,,,,,,,,,,,,,,,,,,,,,,,,"color slides",,"Blacksburg, Montgomery, Virginia, United States",,,,,,,,,"Virginia Polytechnic Institute and State University. University Libraries^^Virginia Polytechnic Institute and State University. University Libraries. Special Collections Department (Repository)","Estate of Leonard J. Currie","Building Construction Lab","American^^university and college buildings^^construction (assembling)^^studios (work spaces)^^Virginia Tech Building Construction Lab^^Leonard J. Currie Slides^^Virginia Tech",,"Currie, Leonard J. (Leonard James), 1913-1996 (Photographer)",,,,,http://rightsstatements.org/vocab/InC-EDU/1.0/,"Virginia Tech Libraries Special Collections^^http://aspace.lib.vt.edu/repositories/2/resources/2315",,,Image,LJC_074_006,,,,,,,,,,,,,,,,,,,,,,,,,,,,,,,,,,,,"American,construction (assembling),Currie - Leonard J,Leonard J. Currie Slides,studios (work spaces),university and college buildings,Virginia Tech,Virginia Tech Building Construction Lab",https://di.lib.vt.edu/files/original/Leonard_J._Currie_s_Slides_Collection/LJC_074_006/LJC_074_006.jpg,,"United States",1,0
2946,https://di.lib.vt.edu/items/show/2946,,,,,"1956 (photo taken)",,,,,,,,,,,,,,,,,,,,,,,"color slides",,"Blacksburg, Montgomery, Virginia, United States",,,,,,,,,"Virginia Polytechnic Institute and State University. University Libraries^^Virginia Polytechnic Institute and State University. University Libraries. Special Collections Department (Repository)","Estate of Leonard J. Currie","Building Construction Symposium","American^^university and college buildings^^construction (assembling)^^events (activities)^^interior views^^Virginia Tech Building Construction Lab^^Leonard J. Currie Slides^^Virginia Tech",,"Currie, Leonard J. (Leonard James), 1913-1996 (Photographer)",,,,,http://rightsstatements.org/vocab/InC-EDU/1.0/,"Virginia Tech Libraries Special Collections^^http://aspace.lib.vt.edu/repositories/2/resources/2315",,,Image,LJC_074_003,,,,,,,,,,,,,,,,,,,,,,,,,,,,,,,,,,,,"American,construction (assembling),Currie - Leonard J,events (activities),interior views,Leonard J. Currie Slides,university and college buildings,Virginia Tech,Virginia Tech Building Construction Lab",https://di.lib.vt.edu/files/original/Leonard_J._Currie_s_Slides_Collection/LJC_074_003/LJC_074_003.jpg,,"United States",1,0
2947,https://di.lib.vt.edu/items/show/2947,,,,,"1956 (photo taken)",,,,,,,,,,,,,,,,,,,,,,,"color slides",,"Blacksburg, Montgomery, Virginia, United States",,,,,,,,,"Virginia Polytechnic Institute and State University. University Libraries^^Virginia Polytechnic Institute and State University. University Libraries. Special Collections Department (Repository)","Estate of Leonard J. Currie","Building Construction Symposium","American^^university and college buildings^^construction (assembling)^^events (activities)^^interior views^^Virginia Tech Building Construction Lab^^Leonard J. Currie Slides^^Virginia Tech",,"Currie, Leonard J. (Leonard James), 1913-1996 (Photographer)",,,,,http://rightsstatements.org/vocab/InC-EDU/1.0/,"Virginia Tech Libraries Special Collections^^http://aspace.lib.vt.edu/repositories/2/resources/2315",,,Image,LJC_074_004,,,,,,,,,,,,,,,,,,,,,,,,,,,,,,,,,,,,"American,construction (assembling),Currie - Leonard J,events (activities),interior views,Leonard J. Currie Slides,university and college buildings,Virginia Tech,Virginia Tech Building Construction Lab",https://di.lib.vt.edu/files/original/Leonard_J._Currie_s_Slides_Collection/LJC_074_004/LJC_074_004.jpg,,"United States",1,0
517,https://di.lib.vt.edu/items/show/517,,,,,"1955-04 (photo taken)",,,,,,,,,,,,,,"Leonard J. Currie Slides",,,,,,,,,"color slides",,"Sogamoso, Boyacá, Colombia",,,,,,,,,"Virginia Polytechnic Institute and State University. University Libraries^^Virginia Polytechnic Institute and State University. University Libraries. Special Collections Department (Repository)","Estate of Leonard J. Currie","Bull Baiting near Sogamoso, Boyacá Department, Colombia","Colombian^^events (activities)^^domestic animals^^shelters (single built works)^^Leonard J. Currie Slides^^South America^^Colombia",,"Currie, Leonard J. (Leonard James), 1913-1996 (Photographer)",,,,,http://rightsstatements.org/vocab/InC-EDU/1.0/,"Virginia Tech Libraries Special Collections^^http://aspace.lib.vt.edu/repositories/2/resources/2315",,,Image,LJC_086_077,,,,,,,,,,,,,,,,,,,,,,,,,,,,,,,,,,,,"Colombia,Currie - Leonard J,domestic animals,events (activities),Leonard J. Currie Slides,shelters (single built works),South America",https://di.lib.vt.edu/files/original/Leonard_J._Currie_s_Slides_Collection/LJC_086_077/LJC_086_077.jpg,,Colombia,1,0
518,https://di.lib.vt.edu/items/show/518,,,,,"1955-01 (photo taken)",,,,,,,,,,,,,,"Leonard J. Currie Slides",,,,,,,,,"color slides",,"Sogamoso, Boyacá, Colombia",,,,,,,,,"Virginia Polytechnic Institute and State University. University Libraries^^Virginia Polytechnic Institute and State University. University Libraries. Special Collections Department (Repository)","Estate of Leonard J. Currie","Bull Baiting near Sogamoso, Boyacá Department, Colombia","Colombian^^domestic animals^^events (activities)^^Leonard J. Currie Slides^^South America^^Colombia",,"Currie, Leonard J. (Leonard James), 1913-1996 (Photographer)",,,,,http://rightsstatements.org/vocab/InC-EDU/1.0/,"Virginia Tech Libraries Special Collections^^http://aspace.lib.vt.edu/repositories/2/resources/2315",,,Image,LJC_086_078,,,,,,,,,,,,,,,,,,,,,,,,,,,,,,,,,,,,"Colombia,Currie - Leonard J,domestic animals,events (activities),Leonard J. Currie Slides,South America",https://di.lib.vt.edu/files/original/Leonard_J._Currie_s_Slides_Collection/LJC_086_078/LJC_086_078.jpg,,Colombia,1,0
1869,https://di.lib.vt.edu/items/show/1869,,,,,"1973-04 (photo taken)",,,,,,,,,,,,,,,,,,,,,,,"color slides",,"Cádiz, Cádiz, Andalusia, Spain",,,,,,,,,"Virginia Polytechnic Institute and State University. University Libraries^^Virginia Polytechnic Institute and State University. University Libraries. Special Collections Department (Repository)","Estate of Leonard J. Currie","Cadiz Cathedral","Spanish^^exterior views^^entrances^^religious buildings^^towers (building divisions)^^Leonard J. Currie Slides^^Europe^^Spain","The box of slides is identified as Spain - Jerez, Cadiz, Vejer de la Frontera, Arcos D.L.F.A., Ubrique, Ronda.","Currie, Leonard J. (Leonard James), 1913-1996 (Photographer)",,,,,http://rightsstatements.org/vocab/InC-EDU/1.0/,"Virginia Tech Libraries Special Collections^^http://aspace.lib.vt.edu/repositories/2/resources/2315",,,Image,LJC_103_034,,,,,,,,,,,,,,,,,,,,,,,,,,,,,,,,,,,,"Currie - Leonard J,entrances,Europe,exterior views,Leonard J. Currie Slides,religious buildings,Spain,Spanish,towers (building divisions)",https://di.lib.vt.edu/files/original/Leonard_J._Currie_s_Slides_Collection/LJC_103_034/LJC_103_034.jpg,,Spain,1,0
1864,https://di.lib.vt.edu/items/show/1864,,,,,"1973-04 (photo taken)",,,,,,,,,,,,,,,,,,,,,,,"color slides",,"Cádiz, Andalusia, Spain",,,,,,,,,"Virginia Polytechnic Institute and State University. University Libraries^^Virginia Polytechnic Institute and State University. University Libraries. Special Collections Department (Repository)","Estate of Leonard J. Currie","Cadiz province, Spain","Spanish^^open spaces^^Leonard J. Currie Slides^^Europe^^Spain","The box of slides is identified as Spain - Jerez, Cadiz, Vejer de la Frontera, Arcos D.L.F.A., Ubrique, Ronda.","Currie, Leonard J. (Leonard James), 1913-1996 (Photographer)",,,,,http://rightsstatements.org/vocab/InC-EDU/1.0/,"Virginia Tech Libraries Special Collections^^http://aspace.lib.vt.edu/repositories/2/resources/2315",,,Image,LJC_103_008,,,,,,,,,,,,,,,,,,,,,,,,,,,,,,,,,,,,"Currie - Leonard J,Europe,Leonard J. Currie Slides,open spaces,Spain,Spanish",https://di.lib.vt.edu/files/original/Leonard_J._Currie_s_Slides_Collection/LJC_103_008/LJC_103_008.jpg,,Spain,1,0