﻿"Item Id","Item URI","Dublin Core:Alternative Title","Dublin Core:Abstract","Dublin Core:Table Of Contents","Dublin Core:Date Available","Dublin Core:Date Created","Dublin Core:Date Accepted","Dublin Core:Date Copyrighted","Dublin Core:Date Submitted","Dublin Core:Date Issued","Dublin Core:Date Modified","Dublin Core:Date Valid","Dublin Core:Access Rights","Dublin Core:License","Dublin Core:Conforms To","Dublin Core:Has Format","Dublin Core:Has Part","Dublin Core:Has Version","Dublin Core:Is Format Of","Dublin Core:Is Part Of","Dublin Core:Is Referenced By","Dublin Core:Is Replaced By","Dublin Core:Is Required By","Dublin Core:Is Version Of","Dublin Core:References","Dublin Core:Replaces","Dublin Core:Requires","Dublin Core:Extent","Dublin Core:Medium","Dublin Core:Bibliographic Citation","Dublin Core:Spatial Coverage","Dublin Core:Temporal Coverage","Dublin Core:Accrual Method","Dublin Core:Accrual Periodicity","Dublin Core:Accrual Policy","Dublin Core:Audience","Dublin Core:Audience Education Level","Dublin Core:Mediator","Dublin Core:Instructional Method","Dublin Core:Provenance","Dublin Core:Rights Holder","Dublin Core:Title","Dublin Core:Subject","Dublin Core:Description","Dublin Core:Creator","Dublin Core:Source","Dublin Core:Publisher","Dublin Core:Date","Dublin Core:Contributor","Dublin Core:Rights","Dublin Core:Relation","Dublin Core:Format","Dublin Core:Language","Dublin Core:Type","Dublin Core:Identifier","Dublin Core:Coverage","Item Type Metadata:Text","Item Type Metadata:Interviewer","Item Type Metadata:Interviewee","Item Type Metadata:Location","Item Type Metadata:Transcription","Item Type Metadata:Local URL","Item Type Metadata:Original Format","Item Type Metadata:Physical Dimensions","Item Type Metadata:Duration","Item Type Metadata:Compression","Item Type Metadata:Producer","Item Type Metadata:Director","Item Type Metadata:Bit Rate/Frequency","Item Type Metadata:Time Summary","Item Type Metadata:Email Body","Item Type Metadata:Subject Line","Item Type Metadata:From","Item Type Metadata:To","Item Type Metadata:CC","Item Type Metadata:BCC","Item Type Metadata:Number of Attachments","Item Type Metadata:Standards","Item Type Metadata:Objectives","Item Type Metadata:Materials","Item Type Metadata:Lesson Plan Text","Item Type Metadata:URL","Item Type Metadata:Event Type","Item Type Metadata:Participants","Item Type Metadata:Birth Date","Item Type Metadata:Birthplace","Item Type Metadata:Death Date","Item Type Metadata:Occupation","Item Type Metadata:Biographical Text","Item Type Metadata:Bibliography",tags,file,itemType,collection,public,featured
3102,https://di.lib.vt.edu/items/show/3102,,,,,"1960 (photo taken)",,,,,,,,,,,,,,,,,,,,,,,"color slides",,"Blacksburg, Montgomery, Virginia, United States",,,,,,,,,"Virginia Polytechnic Institute and State University. University Libraries^^Virginia Polytechnic Institute and State University. University Libraries. Special Collections Department (Repository)","Estate of Leonard J. Currie","Bradley House","American^^construction (assembling)^^residential structures^^houses^^Leonard J. Currie Slides^^Currie Projects^^Bradley House",,"Currie, Leonard J. (Leonard James), 1913-1996 (Photographer)",,,,"Currie, Leonard J. (Leonard James), 1913-1996 (Architect)",http://rightsstatements.org/vocab/InC-EDU/1.0/,"Virginia Tech Libraries Special Collections^^http://aspace.lib.vt.edu/repositories/2/resources/2315",,,Image,LJC_127_005,,,,,,,,,,,,,,,,,,,,,,,,,,,,,,,,,,,,"American,Bradley House,construction (assembling),Currie - Leonard J,Currie Projects,houses,Leonard J. Currie Slides,residential structures",https://di.lib.vt.edu/files/original/Leonard_J._Currie_s_Slides_Collection/LJC_127_005/LJC_127_005.jpg,,"United States",1,0
702,https://di.lib.vt.edu/items/show/702,,,,,"1960-02? (map date)",,,,,,,,,,,,,,"Leonard J. Currie Slides",,,,,,,,,maps,,,,,,,,,,,"Virginia Polytechnic Institute and State University. University Libraries^^Virginia Polytechnic Institute and State University. University Libraries. Special Collections Department (Repository)","Estate of Leonard J. Currie","Cartilla de la Vivienda, CINVA (Inter-American Housing and Planning Center), Bogotá","Colombian^^CINVA (Inter-American Housing and Planning Center)^^maps (documents)^^public housing^^Currie Projects^^CINVA",,"Currie, Leonard J. (Leonard James), 1913-1996 (Photographer)^^CINVA (Inter-American Housing and Planning Center) (Cartographer)",,,,"Currie, Leonard J. (Leonard James), 1913-1996 (Photo Credit)",http://rightsstatements.org/vocab/InC-EDU/1.0/,"Virginia Tech Libraries Special Collections^^http://aspace.lib.vt.edu/repositories/2/resources/2315",,,Image,LJC_087_007,"Bogotá, Bogotá, Distrito Capital de, Colombia",,,,,,,,,,,,,,,,,,,,,,,,,,,,,,,,,,,"CINVA,Colombian,Currie - Leonard J,Currie Projects",https://di.lib.vt.edu/files/original/Leonard_J._Currie_s_Slides_Collection/LJC_087_007/LJC_087_007.jpg,,"CINVA (Inter-American Housing and Planning Center)",1,0
703,https://di.lib.vt.edu/items/show/703,,,,,"1960-02? (drawing date)",,,,,,,,,,,,,,"Leonard J. Currie Slides",,,,,,,,,posters,,,,,,,,,,,"Virginia Polytechnic Institute and State University. University Libraries^^Virginia Polytechnic Institute and State University. University Libraries. Special Collections Department (Repository)","Estate of Leonard J. Currie","Cartilla de la Vivienda, CINVA (Inter-American Housing and Planning Center), Bogotá","Colombian^^CINVA (Inter-American Housing and Planning Center)^^renderings (drawings)^^houses^^residential structures^^construction (assembling)^^Currie Projects^^CINVA",,,,,,"CINVA (Inter-American Housing and Planning Center) (Architect)^^Currie, Leonard J. (Leonard James), 1913-1996 (Photo Credit)",http://rightsstatements.org/vocab/InC-EDU/1.0/,"Virginia Tech Libraries Special Collections^^http://aspace.lib.vt.edu/repositories/2/resources/2315",,,Image,LJC_087_008,"Bogotá, Bogotá, Distrito Capital de, Colombia",,,,,,,,,,,,,,,,,,,,,,,,,,,,,,,,,,,"CINVA,Colombian,Currie - Leonard J,Currie Projects",https://di.lib.vt.edu/files/original/Leonard_J._Currie_s_Slides_Collection/LJC_087_008/LJC_087_008.jpg,,"CINVA (Inter-American Housing and Planning Center)",1,0
683,https://di.lib.vt.edu/items/show/683,,,,,"1955-01 (photo taken)",,,,,,,,,,,,,,"Leonard J. Currie Slides",,,,,,,,,"color slides",,,,,,,,,,,"Virginia Polytechnic Institute and State University. University Libraries^^Virginia Polytechnic Institute and State University. University Libraries. Special Collections Department (Repository)","Estate of Leonard J. Currie","Casa Experimental, CINVA (Inter-American Housing and Planning Center), Bogotá","Colombian^^CINVA (Inter-American Housing and Planning Center)^^construction (assembling)^^residential structures^^houses^^Currie Projects^^CINVA","Experimental house","Currie, Leonard J. (Leonard James), 1913-1996 (Photographer)",,,,,http://rightsstatements.org/vocab/InC-EDU/1.0/,"Virginia Tech Libraries Special Collections^^http://aspace.lib.vt.edu/repositories/2/resources/2315",,,Image,LJC_086_069,"Bogotá, Bogotá, Distrito Capital de, Colombia",,,,,,,,,,,,,,,,,,,,,,,,,,,,,,,,,,,"CINVA,Colombian,Currie - Leonard J,Currie Projects",https://di.lib.vt.edu/files/original/Leonard_J._Currie_s_Slides_Collection/LJC_086_069/LJC_086_069.jpg,,"CINVA (Inter-American Housing and Planning Center)",1,0
665,https://di.lib.vt.edu/items/show/665,,,,,"1953-03 (photo taken)",,,,,,,,,,,,,,"Leonard J. Currie Slides",,,,,,,,,"color slides",,,,,,,,,,,"Virginia Polytechnic Institute and State University. University Libraries^^Virginia Polytechnic Institute and State University. University Libraries. Special Collections Department (Repository)","Estate of Leonard J. Currie","CINVA (Inter-American Housing and Planning Center), Barrio Perseverancia, Bogotá","Colombian^^CINVA (Inter-American Housing and Planning Center)^^genre (visual works)^^public housing^^Currie Projects^^CINVA",,"Currie, Leonard J. (Leonard James), 1913-1996 (Photographer)",,,,,http://rightsstatements.org/vocab/InC-EDU/1.0/,"Virginia Tech Libraries Special Collections^^http://aspace.lib.vt.edu/repositories/2/resources/2315",,,Image,LJC_086_031,"Bogotá, Bogotá, Distrito Capital de, Colombia",,,,,,,,,,,,,,,,,,,,,,,,,,,,,,,,,,,"CINVA,Colombian,Currie - Leonard J,Currie Projects",https://di.lib.vt.edu/files/original/Leonard_J._Currie_s_Slides_Collection/LJC_086_031/LJC_086_031.jpg,,"CINVA (Inter-American Housing and Planning Center)",1,0
666,https://di.lib.vt.edu/items/show/666,,,,,"1953-03 (photo taken)",,,,,,,,,,,,,,"Leonard J. Currie Slides",,,,,,,,,"color slides",,,,,,,,,,,"Virginia Polytechnic Institute and State University. University Libraries^^Virginia Polytechnic Institute and State University. University Libraries. Special Collections Department (Repository)","Estate of Leonard J. Currie","CINVA (Inter-American Housing and Planning Center), Barrio Perseverancia, Bogotá","Colombian^^CINVA (Inter-American Housing and Planning Center)^^genre (visual works)^^public housing^^Currie Projects^^CINVA",,"Currie, Leonard J. (Leonard James), 1913-1996 (Photographer)",,,,,http://rightsstatements.org/vocab/InC-EDU/1.0/,"Virginia Tech Libraries Special Collections^^http://aspace.lib.vt.edu/repositories/2/resources/2315",,,Image,LJC_086_032,"Bogotá, Bogotá, Distrito Capital de, Colombia",,,,,,,,,,,,,,,,,,,,,,,,,,,,,,,,,,,"CINVA,Colombian,Currie - Leonard J,Currie Projects",https://di.lib.vt.edu/files/original/Leonard_J._Currie_s_Slides_Collection/LJC_086_032/LJC_086_032.jpg,,"CINVA (Inter-American Housing and Planning Center)",1,0
667,https://di.lib.vt.edu/items/show/667,,,,,"1953-03 (photo taken)",,,,,,,,,,,,,,"Leonard J. Currie Slides",,,,,,,,,"color slides",,,,,,,,,,,"Virginia Polytechnic Institute and State University. University Libraries^^Virginia Polytechnic Institute and State University. University Libraries. Special Collections Department (Repository)","Estate of Leonard J. Currie","CINVA (Inter-American Housing and Planning Center), Barrio Perseverancia, Bogotá","Colombian^^CINVA (Inter-American Housing and Planning Center)^^genre (visual works)^^public housing^^Currie Projects^^CINVA",,"Currie, Leonard J. (Leonard James), 1913-1996 (Photographer)",,,,,http://rightsstatements.org/vocab/InC-EDU/1.0/,"Virginia Tech Libraries Special Collections^^http://aspace.lib.vt.edu/repositories/2/resources/2315",,,Image,LJC_086_033,"Bogotá, Bogotá, Distrito Capital de, Colombia",,,,,,,,,,,,,,,,,,,,,,,,,,,,,,,,,,,"CINVA,Colombian,Currie - Leonard J,Currie Projects",https://di.lib.vt.edu/files/original/Leonard_J._Currie_s_Slides_Collection/LJC_086_033/LJC_086_033.jpg,,"CINVA (Inter-American Housing and Planning Center)",1,0
668,https://di.lib.vt.edu/items/show/668,,,,,"1953-03 (photo taken)",,,,,,,,,,,,,,"Leonard J. Currie Slides",,,,,,,,,"color slides",,,,,,,,,,,"Virginia Polytechnic Institute and State University. University Libraries^^Virginia Polytechnic Institute and State University. University Libraries. Special Collections Department (Repository)","Estate of Leonard J. Currie","CINVA (Inter-American Housing and Planning Center), Barrio Perseverancia, Bogotá","Colombian^^CINVA (Inter-American Housing and Planning Center)^^genre (visual works)^^public housing^^Currie Projects^^CINVA",,"Currie, Leonard J. (Leonard James), 1913-1996 (Photographer)",,,,,http://rightsstatements.org/vocab/InC-EDU/1.0/,"Virginia Tech Libraries Special Collections^^http://aspace.lib.vt.edu/repositories/2/resources/2315",,,Image,LJC_086_034,"Bogotá, Bogotá, Distrito Capital de, Colombia",,,,,,,,,,,,,,,,,,,,,,,,,,,,,,,,,,,"CINVA,Colombian,Currie - Leonard J,Currie Projects",https://di.lib.vt.edu/files/original/Leonard_J._Currie_s_Slides_Collection/LJC_086_034/LJC_086_034.jpg,,"CINVA (Inter-American Housing and Planning Center)",1,0
662,https://di.lib.vt.edu/items/show/662,,,,,"1952-02 (photo taken)",,,,,,,,,,,,,,"Leonard J. Currie Slides",,,,,,,,,"color slides",,,,,,,,,,,"Virginia Polytechnic Institute and State University. University Libraries^^Virginia Polytechnic Institute and State University. University Libraries. Special Collections Department (Repository)","Estate of Leonard J. Currie","CINVA (Inter-American Housing and Planning Center), Bogotá","Colombian^^CINVA (Inter-American Housing and Planning Center)^^exterior views^^office buildings^^university and college buildings^^portraits^^Currie Projects^^CINVA",,"Currie, Leonard J. (Leonard James), 1913-1996 (Photographer)",,,,,http://rightsstatements.org/vocab/InC-EDU/1.0/,"Virginia Tech Libraries Special Collections^^http://aspace.lib.vt.edu/repositories/2/resources/2315",,,Image,LJC_086_019,"Bogotá, Bogotá, Distrito Capital de, Colombia",,,,,,,,,,,,,,,,,,,,,,,,,,,,,,,,,,,"CINVA,Colombian,Currie - Leonard J,Currie Projects",https://di.lib.vt.edu/files/original/Leonard_J._Currie_s_Slides_Collection/LJC_086_019/LJC_086_019.jpg,,"CINVA (Inter-American Housing and Planning Center)",1,0
663,https://di.lib.vt.edu/items/show/663,,,,,"1952-03 (photo taken)",,,,,,,,,,,,,,"Leonard J. Currie Slides",,,,,,,,,"color slides",,,,,,,,,,,"Virginia Polytechnic Institute and State University. University Libraries^^Virginia Polytechnic Institute and State University. University Libraries. Special Collections Department (Repository)","Estate of Leonard J. Currie","CINVA (Inter-American Housing and Planning Center), Bogotá","Colombian^^CINVA (Inter-American Housing and Planning Center)^^exterior views^^Currie Projects^^CINVA",,"Currie, Leonard J. (Leonard James), 1913-1996 (Photographer)",,,,,http://rightsstatements.org/vocab/InC-EDU/1.0/,"Virginia Tech Libraries Special Collections^^http://aspace.lib.vt.edu/repositories/2/resources/2315",,,Image,LJC_086_021,"Bogotá, Bogotá, Distrito Capital de, Colombia",,,,,,,,,,,,,,,,,,,,,,,,,,,,,,,,,,,"CINVA,Colombian,Currie - Leonard J,Currie Projects",https://di.lib.vt.edu/files/original/Leonard_J._Currie_s_Slides_Collection/LJC_086_021/LJC_086_021.jpg,,"CINVA (Inter-American Housing and Planning Center)",1,0
675,https://di.lib.vt.edu/items/show/675,,,,,"1654-05 (photo taken)",,,,,,,,,,,,,,"Leonard J. Currie Slides",,,,,,,,,"color slides",,,,,,,,,,,"Virginia Polytechnic Institute and State University. University Libraries^^Virginia Polytechnic Institute and State University. University Libraries. Special Collections Department (Repository)","Estate of Leonard J. Currie","CINVA (Inter-American Housing and Planning Center), Bogotá","Colombian^^CINVA (Inter-American Housing and Planning Center)^^courtyards^^office buildings^^landscape gardening^^university and college buildings^^Currie Projects^^CINVA",,"Currie, Leonard J. (Leonard James), 1913-1996 (Photographer)",,,,,http://rightsstatements.org/vocab/InC-EDU/1.0/,"Virginia Tech Libraries Special Collections^^http://aspace.lib.vt.edu/repositories/2/resources/2315",,,Image,LJC_086_052,"Bogotá, Distrito Capital de, Colombia",,,,,,,,,,,,,,,,,,,,,,,,,,,,,,,,,,,"CINVA,Colombian,Currie - Leonard J,Currie Projects",https://di.lib.vt.edu/files/original/Leonard_J._Currie_s_Slides_Collection/LJC_086_052/LJC_086_052.jpg,,"CINVA (Inter-American Housing and Planning Center)",1,0
676,https://di.lib.vt.edu/items/show/676,,,,,"1954-06 (photo taken)",,,,,,,,,,,,,,"Leonard J. Currie Slides",,,,,,,,,"color slides",,,,,,,,,,,"Virginia Polytechnic Institute and State University. University Libraries^^Virginia Polytechnic Institute and State University. University Libraries. Special Collections Department (Repository)","Estate of Leonard J. Currie","CINVA (Inter-American Housing and Planning Center), Bogotá","Colombian^^CINVA (Inter-American Housing and Planning Center)^^courtyards^^landscape gardening^^office buildings^^university and college buildings^^Currie Projects^^CINVA",,"Currie, Leonard J. (Leonard James), 1913-1996 (Photographer)",,,,,http://rightsstatements.org/vocab/InC-EDU/1.0/,"Virginia Tech Libraries Special Collections^^http://aspace.lib.vt.edu/repositories/2/resources/2315",,,Image,LJC_086_053,"Bogotá, Bogotá, Distrito Capital de, Colombia",,,,,,,,,,,,,,,,,,,,,,,,,,,,,,,,,,,"CINVA,Colombian,Currie - Leonard J,Currie Projects",https://di.lib.vt.edu/files/original/Leonard_J._Currie_s_Slides_Collection/LJC_086_053/LJC_086_053.jpg,,"CINVA (Inter-American Housing and Planning Center)",1,0
679,https://di.lib.vt.edu/items/show/679,,,,,"1954-12 (photo taken)",,,,,,,,,,,,,,"Leonard J. Currie Slides",,,,,,,,,"color slides",,,,,,,,,,,"Virginia Polytechnic Institute and State University. University Libraries^^Virginia Polytechnic Institute and State University. University Libraries. Special Collections Department (Repository)","Estate of Leonard J. Currie","CINVA (Inter-American Housing and Planning Center), Bogotá","Colombian^^CINVA (Inter-American Housing and Planning Center)^^exterior views^^office buildings^^university and college buildings^^Currie Projects^^CINVA",,"Currie, Leonard J. (Leonard James), 1913-1996 (Photographer)",,,,,http://rightsstatements.org/vocab/InC-EDU/1.0/,"Virginia Tech Libraries Special Collections^^http://aspace.lib.vt.edu/repositories/2/resources/2315",,,Image,LJC_086_065,"Bogotá, Bogotá, Distrito Capital de, Colombia",,,,,,,,,,,,,,,,,,,,,,,,,,,,,,,,,,,"CINVA,Colombian,Currie - Leonard J,Currie Projects",https://di.lib.vt.edu/files/original/Leonard_J._Currie_s_Slides_Collection/LJC_086_065/LJC_086_065.jpg,,"CINVA (Inter-American Housing and Planning Center)",1,0
680,https://di.lib.vt.edu/items/show/680,,,,,"1954-12 (photo taken)",,,,,,,,,,,,,,"Leonard J. Currie Slides",,,,,,,,,"color slides",,,,,,,,,,,"Virginia Polytechnic Institute and State University. University Libraries^^Virginia Polytechnic Institute and State University. University Libraries. Special Collections Department (Repository)","Estate of Leonard J. Currie","CINVA (Inter-American Housing and Planning Center), Bogotá","Colombian^^CINVA (Inter-American Housing and Planning Center)^^exterior views^^office buildings^^university and college buildings^^Currie Projects^^CINVA",,"Currie, Leonard J. (Leonard James), 1913-1996 (Photographer)",,,,,http://rightsstatements.org/vocab/InC-EDU/1.0/,"Virginia Tech Libraries Special Collections^^http://aspace.lib.vt.edu/repositories/2/resources/2315",,,Image,LJC_086_066,"Bogotá, Bogotá, Distrito Capital de, Colombia",,,,,,,,,,,,,,,,,,,,,,,,,,,,,,,,,,,"CINVA,Colombian,Currie - Leonard J,Currie Projects",https://di.lib.vt.edu/files/original/Leonard_J._Currie_s_Slides_Collection/LJC_086_066/LJC_086_066.jpg,,"CINVA (Inter-American Housing and Planning Center)",1,0
681,https://di.lib.vt.edu/items/show/681,,,,,"1954-12 (photo taken)",,,,,,,,,,,,,,"Leonard J. Currie Slides",,,,,,,,,"color slides",,,,,,,,,,,"Virginia Polytechnic Institute and State University. University Libraries^^Virginia Polytechnic Institute and State University. University Libraries. Special Collections Department (Repository)","Estate of Leonard J. Currie","CINVA (Inter-American Housing and Planning Center), Bogotá","Colombian^^CINVA (Inter-American Housing and Planning Center)^^entrances^^exterior views^^office buildings^^university and college buildings^^Currie Projects^^CINVA",,"Currie, Leonard J. (Leonard James), 1913-1996 (Photographer)",,,,,http://rightsstatements.org/vocab/InC-EDU/1.0/,"Virginia Tech Libraries Special Collections^^http://aspace.lib.vt.edu/repositories/2/resources/2315",,,Image,LJC_086_067,"Bogotá, Bogotá, Distrito Capital de, Colombia",,,,,,,,,,,,,,,,,,,,,,,,,,,,,,,,,,,"CINVA,Colombian,Currie - Leonard J,Currie Projects",https://di.lib.vt.edu/files/original/Leonard_J._Currie_s_Slides_Collection/LJC_086_067/LJC_086_067.jpg,,"CINVA (Inter-American Housing and Planning Center)",1,0
695,https://di.lib.vt.edu/items/show/695,,,,,"1956-04 (photo taken)",,,,,,,,,,,,,,"Leonard J. Currie Slides",,,,,,,,,"color slides",,,,,,,,,,,"Virginia Polytechnic Institute and State University. University Libraries^^Virginia Polytechnic Institute and State University. University Libraries. Special Collections Department (Repository)","Estate of Leonard J. Currie","CINVA (Inter-American Housing and Planning Center), Bogotá","Colombian^^CINVA (Inter-American Housing and Planning Center)^^exterior views^^office buildings^^university and college buildings^^Currie Projects^^CINVA",,"Currie, Leonard J. (Leonard James), 1913-1996 (Photographer)",,,,,http://rightsstatements.org/vocab/InC-EDU/1.0/,"Virginia Tech Libraries Special Collections^^http://aspace.lib.vt.edu/repositories/2/resources/2315",,,Image,LJC_086_095,"Bogotá, Bogotá, Distrito Capital de, Colombia",,,,,,,,,,,,,,,,,,,,,,,,,,,,,,,,,,,"CINVA,Colombian,Currie - Leonard J,Currie Projects",https://di.lib.vt.edu/files/original/Leonard_J._Currie_s_Slides_Collection/LJC_086_095/LJC_086_095.jpg,,"CINVA (Inter-American Housing and Planning Center)",1,0
696,https://di.lib.vt.edu/items/show/696,,,,,"1956-04 (photo taken)",,,,,,,,,,,,,,"Leonard J. Currie Slides",,,,,,,,,"color slides",,,,,,,,,,,"Virginia Polytechnic Institute and State University. University Libraries^^Virginia Polytechnic Institute and State University. University Libraries. Special Collections Department (Repository)","Estate of Leonard J. Currie","CINVA (Inter-American Housing and Planning Center), Bogotá","Colombian^^CINVA (Inter-American Housing and Planning Center)^^events (activities)^^portraits^^Currie Projects^^CINVA",,"Currie, Leonard J. (Leonard James), 1913-1996 (Photographer)",,,,,http://rightsstatements.org/vocab/InC-EDU/1.0/,"Virginia Tech Libraries Special Collections^^http://aspace.lib.vt.edu/repositories/2/resources/2315",,,Image,LJC_086_096,"Bogotá, Bogotá, Distrito Capital de, Colombia",,,,,,,,,,,,,,,,,,,,,,,,,,,,,,,,,,,"CINVA,Colombian,Currie - Leonard J,Currie Projects",https://di.lib.vt.edu/files/original/Leonard_J._Currie_s_Slides_Collection/LJC_086_096/LJC_086_096.jpg,,"CINVA (Inter-American Housing and Planning Center)",1,0
697,https://di.lib.vt.edu/items/show/697,,,,,"1956-04 (photo taken)",,,,,,,,,,,,,,"Leonard J. Currie Slides",,,,,,,,,"color slides",,,,,,,,,,,"Virginia Polytechnic Institute and State University. University Libraries^^Virginia Polytechnic Institute and State University. University Libraries. Special Collections Department (Repository)","Estate of Leonard J. Currie","CINVA (Inter-American Housing and Planning Center), Bogotá","Colombian^^CINVA (Inter-American Housing and Planning Center)^^courtyards^^landscape gardening^^Currie Projects^^CINVA",,"Currie, Leonard J. (Leonard James), 1913-1996 (Photographer)",,,,,http://rightsstatements.org/vocab/InC-EDU/1.0/,"Virginia Tech Libraries Special Collections^^http://aspace.lib.vt.edu/repositories/2/resources/2315",,,Image,LJC_086_097,"Bogotá, Bogotá, Distrito Capital de, Colombia",,,,,,,,,,,,,,,,,,,,,,,,,,,,,,,,,,,"CINVA,Colombian,Currie - Leonard J,Currie Projects",https://di.lib.vt.edu/files/original/Leonard_J._Currie_s_Slides_Collection/LJC_086_097/LJC_086_097.jpg,,"CINVA (Inter-American Housing and Planning Center)",1,0
698,https://di.lib.vt.edu/items/show/698,,,,,"1956-04 (photo taken)",,,,,,,,,,,,,,"Leonard J. Currie Slides",,,,,,,,,"color slides",,,,,,,,,,,"Virginia Polytechnic Institute and State University. University Libraries^^Virginia Polytechnic Institute and State University. University Libraries. Special Collections Department (Repository)","Estate of Leonard J. Currie","CINVA (Inter-American Housing and Planning Center), Bogotá","Colombian^^CINVA (Inter-American Housing and Planning Center)^^office buildings^^exterior views^^university and college buildings^^Currie Projects^^CINVA",,"Currie, Leonard J. (Leonard James), 1913-1996 (Photographer)",,,,,http://rightsstatements.org/vocab/InC-EDU/1.0/,"Virginia Tech Libraries Special Collections^^http://aspace.lib.vt.edu/repositories/2/resources/2315",,,Image,LJC_087_002,"Bogotá, Bogotá, Distrito Capital de, Colombia",,,,,,,,,,,,,,,,,,,,,,,,,,,,,,,,,,,"CINVA,Colombian,Currie - Leonard J,Currie Projects",https://di.lib.vt.edu/files/original/Leonard_J._Currie_s_Slides_Collection/LJC_087_002/LJC_087_002.jpg,,"CINVA (Inter-American Housing and Planning Center)",1,0