﻿"Item Id","Item URI","Dublin Core:Alternative Title","Dublin Core:Abstract","Dublin Core:Table Of Contents","Dublin Core:Date Available","Dublin Core:Date Created","Dublin Core:Date Accepted","Dublin Core:Date Copyrighted","Dublin Core:Date Submitted","Dublin Core:Date Issued","Dublin Core:Date Modified","Dublin Core:Date Valid","Dublin Core:Access Rights","Dublin Core:License","Dublin Core:Conforms To","Dublin Core:Has Format","Dublin Core:Has Part","Dublin Core:Has Version","Dublin Core:Is Format Of","Dublin Core:Is Part Of","Dublin Core:Is Referenced By","Dublin Core:Is Replaced By","Dublin Core:Is Required By","Dublin Core:Is Version Of","Dublin Core:References","Dublin Core:Replaces","Dublin Core:Requires","Dublin Core:Extent","Dublin Core:Medium","Dublin Core:Bibliographic Citation","Dublin Core:Spatial Coverage","Dublin Core:Temporal Coverage","Dublin Core:Accrual Method","Dublin Core:Accrual Periodicity","Dublin Core:Accrual Policy","Dublin Core:Audience","Dublin Core:Audience Education Level","Dublin Core:Mediator","Dublin Core:Instructional Method","Dublin Core:Provenance","Dublin Core:Rights Holder","Dublin Core:Title","Dublin Core:Subject","Dublin Core:Description","Dublin Core:Creator","Dublin Core:Source","Dublin Core:Publisher","Dublin Core:Date","Dublin Core:Contributor","Dublin Core:Rights","Dublin Core:Relation","Dublin Core:Format","Dublin Core:Language","Dublin Core:Type","Dublin Core:Identifier","Dublin Core:Coverage","Item Type Metadata:Text","Item Type Metadata:Interviewer","Item Type Metadata:Interviewee","Item Type Metadata:Location","Item Type Metadata:Transcription","Item Type Metadata:Local URL","Item Type Metadata:Original Format","Item Type Metadata:Physical Dimensions","Item Type Metadata:Duration","Item Type Metadata:Compression","Item Type Metadata:Producer","Item Type Metadata:Director","Item Type Metadata:Bit Rate/Frequency","Item Type Metadata:Time Summary","Item Type Metadata:Email Body","Item Type Metadata:Subject Line","Item Type Metadata:From","Item Type Metadata:To","Item Type Metadata:CC","Item Type Metadata:BCC","Item Type Metadata:Number of Attachments","Item Type Metadata:Standards","Item Type Metadata:Objectives","Item Type Metadata:Materials","Item Type Metadata:Lesson Plan Text","Item Type Metadata:URL","Item Type Metadata:Event Type","Item Type Metadata:Participants","Item Type Metadata:Birth Date","Item Type Metadata:Birthplace","Item Type Metadata:Death Date","Item Type Metadata:Occupation","Item Type Metadata:Biographical Text","Item Type Metadata:Bibliography",tags,file,itemType,collection,public,featured
2174,https://di.lib.vt.edu/items/show/2174,,,,,"1951-07 (photo taken)",,,,,,,,,,,,,,,,,,,,,,,"color slides",,Panama,,,,,,,,,"Virginia Polytechnic Institute and State University. University Libraries^^Virginia Polytechnic Institute and State University. University Libraries. Special Collections Department (Repository)","Estate of Leonard J. Currie","University of Panama","Panamanian^^university and college buildings^^exterior views^^Leonard J. Currie Slides^^Central America^^Panama",,"Currie, Leonard J. (Leonard James), 1913-1996 (Photographer)",,,,"de Roux & Bermudez, Architects (Architect)",http://rightsstatements.org/vocab/InC-EDU/1.0/,"Virginia Tech Libraries Special Collections^^http://aspace.lib.vt.edu/repositories/2/resources/2315",,,Image,LJC_183_042,,,,,,,,,,,,,,,,,,,,,,,,,,,,,,,,,,,,"Central America,Currie - Leonard J,de Roux & Bermudez Architects,exterior views,Leonard J. Currie Slides,Panama,Panamanian,university and college buildings",https://di.lib.vt.edu/files/original/Leonard_J._Currie_s_Slides_Collection/LJC_183_042/LJC_183_042.jpg,,Panama,1,0
2173,https://di.lib.vt.edu/items/show/2173,,,,,"1951-07 (photo taken)",,,,,,,,,,,,,,,,,,,,,,,"color slides",,Panama,,,,,,,,,"Virginia Polytechnic Institute and State University. University Libraries^^Virginia Polytechnic Institute and State University. University Libraries. Special Collections Department (Repository)","Estate of Leonard J. Currie","University of Panama Library","Panamanian^^university and college buildings^^exterior views^^Leonard J. Currie Slides^^Central America^^Panama",,"Currie, Leonard J. (Leonard James), 1913-1996 (Photographer)",,,,"de Roux & Bermudez, Architects (Architect)",http://rightsstatements.org/vocab/InC-EDU/1.0/,"Virginia Tech Libraries Special Collections^^http://aspace.lib.vt.edu/repositories/2/resources/2315",,,Image,LJC_183_041,,,,,,,,,,,,,,,,,,,,,,,,,,,,,,,,,,,,"Central America,Currie - Leonard J,de Roux & Bermudez Architects,exterior views,Leonard J. Currie Slides,Panama,Panamanian,university and college buildings",https://di.lib.vt.edu/files/original/Leonard_J._Currie_s_Slides_Collection/LJC_183_041/LJC_183_041.jpg,,Panama,1,0
2172,https://di.lib.vt.edu/items/show/2172,,,,,"1951-07 (photo taken)",,,,,,,,,,,,,,,,,,,,,,,"color slides",,Panama,,,,,,,,,"Virginia Polytechnic Institute and State University. University Libraries^^Virginia Polytechnic Institute and State University. University Libraries. Special Collections Department (Repository)","Estate of Leonard J. Currie","University of Panama Library - designer de Roux in foreground","Panamanian^^Roux, Guillermo de^^university and college buildings^^exterior views^^portraits^^Leonard J. Currie Slides^^Central America^^Panama",,"Currie, Leonard J. (Leonard James), 1913-1996 (Photographer)",,,,"de Roux & Bermudez, Architects (Architect)",http://rightsstatements.org/vocab/InC-EDU/1.0/,"Virginia Tech Libraries Special Collections^^http://aspace.lib.vt.edu/repositories/2/resources/2315",,,Image,LJC_183_040,,,,,,,,,,,,,,,,,,,,,,,,,,,,,,,,,,,,"Central America,Currie - Leonard J,de Roux & Bermudez Architects,exterior views,Leonard J. Currie Slides,Panama,Panamanian,portraits,Roux, Guillermo de,university and college buildings",https://di.lib.vt.edu/files/original/Leonard_J._Currie_s_Slides_Collection/LJC_183_040/LJC_183_040.jpg,,Panama,1,0
2171,https://di.lib.vt.edu/items/show/2171,,,,,"1951-07 (photo taken)",,,,,,,,,,,,,,,,,,,,,,,"color slides",,Panama,,,,,,,,,"Virginia Polytechnic Institute and State University. University Libraries^^Virginia Polytechnic Institute and State University. University Libraries. Special Collections Department (Repository)","Estate of Leonard J. Currie","University of Panama Library","Panamanian^^university and college buildings^^exterior views^^Leonard J. Currie Slides^^Central America^^Panama",,"Currie, Leonard J. (Leonard James), 1913-1996 (Photographer)",,,,"de Roux & Bermudez, Architects (Architect)",http://rightsstatements.org/vocab/InC-EDU/1.0/,"Virginia Tech Libraries Special Collections^^http://aspace.lib.vt.edu/repositories/2/resources/2315",,,Image,LJC_183_039,,,,,,,,,,,,,,,,,,,,,,,,,,,,,,,,,,,,"Central America,Currie - Leonard J,de Roux & Bermudez Architects,exterior views,Leonard J. Currie Slides,Panama,Panamanian,university and college buildings",https://di.lib.vt.edu/files/original/Leonard_J._Currie_s_Slides_Collection/LJC_183_039/LJC_183_039.jpg,,Panama,1,0
2170,https://di.lib.vt.edu/items/show/2170,,,,,"1951-07 (photo taken)",,,,,,,,,,,,,,,,,,,,,,,"color slides",,Panama,,,,,,,,,"Virginia Polytechnic Institute and State University. University Libraries^^Virginia Polytechnic Institute and State University. University Libraries. Special Collections Department (Repository)","Estate of Leonard J. Currie","School in city - almost completed","Panamanian^^exterior views^^schools (buildings)^^construction (assembling)^^Leonard J. Currie Slides^^Central America^^Panama",,"Currie, Leonard J. (Leonard James), 1913-1996 (Photographer)",,,,,http://rightsstatements.org/vocab/InC-EDU/1.0/,"Virginia Tech Libraries Special Collections^^http://aspace.lib.vt.edu/repositories/2/resources/2315",,,Image,LJC_183_038,,,,,,,,,,,,,,,,,,,,,,,,,,,,,,,,,,,,"Central America,construction (assembling),Currie - Leonard J,exterior views,Leonard J. Currie Slides,Panama,Panamanian,schools (buildings)",https://di.lib.vt.edu/files/original/Leonard_J._Currie_s_Slides_Collection/LJC_183_038/LJC_183_038.jpg,,Panama,1,0
2169,https://di.lib.vt.edu/items/show/2169,,,,,"1951-07 (photo taken)",,,,,,,,,,,,,,,,,,,,,,,"color slides",,Panama,,,,,,,,,"Virginia Polytechnic Institute and State University. University Libraries^^Virginia Polytechnic Institute and State University. University Libraries. Special Collections Department (Repository)","Estate of Leonard J. Currie","School in city - almost completed","Panamanian^^exterior views^^schools (buildings)^^construction (assembling)^^Leonard J. Currie Slides^^Central America^^Panama",,"Currie, Leonard J. (Leonard James), 1913-1996 (Photographer)",,,,,http://rightsstatements.org/vocab/InC-EDU/1.0/,"Virginia Tech Libraries Special Collections^^http://aspace.lib.vt.edu/repositories/2/resources/2315",,,Image,LJC_183_037,,,,,,,,,,,,,,,,,,,,,,,,,,,,,,,,,,,,"Central America,construction (assembling),Currie - Leonard J,exterior views,Leonard J. Currie Slides,Panama,Panamanian,schools (buildings)",https://di.lib.vt.edu/files/original/Leonard_J._Currie_s_Slides_Collection/LJC_183_037/LJC_183_037.jpg,,Panama,1,0
2168,https://di.lib.vt.edu/items/show/2168,,,,,"1951-07 (photo taken)",,,,,,,,,,,,,,,,,,,,,,,"color slides",,Panama,,,,,,,,,"Virginia Polytechnic Institute and State University. University Libraries^^Virginia Polytechnic Institute and State University. University Libraries. Special Collections Department (Repository)","Estate of Leonard J. Currie","de Roux & Bermudez, Architects","Panamanian^^exterior views^^construction (assembling)^^Leonard J. Currie Slides^^Central America^^Panama",,"Currie, Leonard J. (Leonard James), 1913-1996 (Photographer)",,,,"de Roux & Bermudez, Architects (Architect)",http://rightsstatements.org/vocab/InC-EDU/1.0/,"Virginia Tech Libraries Special Collections^^http://aspace.lib.vt.edu/repositories/2/resources/2315",,,Image,LJC_183_036,,,,,,,,,,,,,,,,,,,,,,,,,,,,,,,,,,,,"Central America,construction (assembling),Currie - Leonard J,de Roux & Bermudez Architects,exterior views,Leonard J. Currie Slides,Panama,Panamanian",https://di.lib.vt.edu/files/original/Leonard_J._Currie_s_Slides_Collection/LJC_183_036/LJC_183_036.jpg,,Panama,1,0
2167,https://di.lib.vt.edu/items/show/2167,,,,,"1951-07 (photo taken)",,,,,,,,,,,,,,,,,,,,,,,"color slides",,Panama,,,,,,,,,"Virginia Polytechnic Institute and State University. University Libraries^^Virginia Polytechnic Institute and State University. University Libraries. Special Collections Department (Repository)","Estate of Leonard J. Currie","House by Guillermo de Roux for his brother","Panamanian^^Roux, Guillermo de^^exterior views^^houses^^portraits^^Leonard J. Currie Slides^^Central America^^Panama","Guillermo de Roux in the foreground","Currie, Leonard J. (Leonard James), 1913-1996 (Photographer)",,,,"Roux, Guillermo de (Architect)",http://rightsstatements.org/vocab/InC-EDU/1.0/,"Virginia Tech Libraries Special Collections^^http://aspace.lib.vt.edu/repositories/2/resources/2315",,,Image,LJC_183_030,,,,,,,,,,,,,,,,,,,,,,,,,,,,,,,,,,,,"Central America,Currie - Leonard J,exterior views,houses,Leonard J. Currie Slides,Panama,Panamanian,portraits,Roux, Guillermo de",https://di.lib.vt.edu/files/original/Leonard_J._Currie_s_Slides_Collection/LJC_183_030/LJC_183_030.jpg,,Panama,1,0
2166,https://di.lib.vt.edu/items/show/2166,,,,,"1956-02 (photo taken)",,,,,,,,,,,,,,,,,,,,,,,"color slides",,Panama,,,,,,,,,"Virginia Polytechnic Institute and State University. University Libraries^^Virginia Polytechnic Institute and State University. University Libraries. Special Collections Department (Repository)","Estate of Leonard J. Currie","University or Panama","Panamanian^^university and college buildings^^exterior views^^Leonard J. Currie Slides^^Central America^^Panama",,"Currie, Leonard J. (Leonard James), 1913-1996 (Photographer)",,,,"de Roux & Bermudez, Architects (Architect)",http://rightsstatements.org/vocab/InC-EDU/1.0/,"Virginia Tech Libraries Special Collections^^http://aspace.lib.vt.edu/repositories/2/resources/2315",,,Image,LJC_183_029,,,,,,,,,,,,,,,,,,,,,,,,,,,,,,,,,,,,"Central America,Currie - Leonard J,de Roux & Bermudez Architects,exterior views,Leonard J. Currie Slides,Panama,Panamanian,university and college buildings",https://di.lib.vt.edu/files/original/Leonard_J._Currie_s_Slides_Collection/LJC_183_029/LJC_183_029.jpg,,Panama,1,0
2165,https://di.lib.vt.edu/items/show/2165,,,,,"1952-01 (photo taken)",,,,,,,,,,,,,,,,,,,,,,,"color slides",,Panama,,,,,,,,,"Virginia Polytechnic Institute and State University. University Libraries^^Virginia Polytechnic Institute and State University. University Libraries. Special Collections Department (Repository)","Estate of Leonard J. Currie","Grace Line - N.Y. to B.V. - islands of Panama, Pacific side","Panamanian^^waterways^^landscapes (environments)^^watercraft^^oceans^^Leonard J. Currie Slides^^Central America^^Panama",,"Currie, Leonard J. (Leonard James), 1913-1996 (Photographer)",,,,,http://rightsstatements.org/vocab/InC-EDU/1.0/,"Virginia Tech Libraries Special Collections^^http://aspace.lib.vt.edu/repositories/2/resources/2315",,,Image,LJC_183_025,,,,,,,,,,,,,,,,,,,,,,,,,,,,,,,,,,,,"Central America,Currie - Leonard J,landscapes (environments),Leonard J. Currie Slides,oceans,Panama,Panamanian,watercraft,waterways",https://di.lib.vt.edu/files/original/Leonard_J._Currie_s_Slides_Collection/LJC_183_025/LJC_183_025.jpg,,Panama,1,0
2164,https://di.lib.vt.edu/items/show/2164,,,,,"1956-02 (photo taken)",,,,,,,,,,,,,,,,,,,,,,,"color slides",,Panama,,,,,,,,,"Virginia Polytechnic Institute and State University. University Libraries^^Virginia Polytechnic Institute and State University. University Libraries. Special Collections Department (Repository)","Estate of Leonard J. Currie","University of Panama","Panamanian^^Leonard J. Currie Slides^^Central America^^Panama",,"Currie, Leonard J. (Leonard James), 1913-1996 (Photographer)",,,,"de Roux & Bermudez, Architects (Architect)",http://rightsstatements.org/vocab/InC-EDU/1.0/,"Virginia Tech Libraries Special Collections^^http://aspace.lib.vt.edu/repositories/2/resources/2315",,,Image,LJC_183_014,,,,,,,,,,,,,,,,,,,,,,,,,,,,,,,,,,,,"Central America,Currie - Leonard J,de Roux & Bermudez Architects,Leonard J. Currie Slides,Panama,Panamanian",https://di.lib.vt.edu/files/original/Leonard_J._Currie_s_Slides_Collection/LJC_183_014/LJC_183_014.jpg,,Panama,1,0
2163,https://di.lib.vt.edu/items/show/2163,,,,,"1956-02 (photo taken)",,,,,,,,,,,,,,,,,,,,,,,"color slides",,Panama,,,,,,,,,"Virginia Polytechnic Institute and State University. University Libraries^^Virginia Polytechnic Institute and State University. University Libraries. Special Collections Department (Repository)","Estate of Leonard J. Currie","University of Panama","Panamanian^^university and college buildings^^exterior views^^Leonard J. Currie Slides^^Central America^^Panama",,"Currie, Leonard J. (Leonard James), 1913-1996 (Photographer)",,,,"de Roux & Bermudez, Architects (Architect)",http://rightsstatements.org/vocab/InC-EDU/1.0/,"Virginia Tech Libraries Special Collections^^http://aspace.lib.vt.edu/repositories/2/resources/2315",,,Image,LJC_183_013,,,,,,,,,,,,,,,,,,,,,,,,,,,,,,,,,,,,"Central America,Currie - Leonard J,de Roux & Bermudez Architects,exterior views,Leonard J. Currie Slides,Panama,Panamanian,university and college buildings",https://di.lib.vt.edu/files/original/Leonard_J._Currie_s_Slides_Collection/LJC_183_013/LJC_183_013.jpg,,Panama,1,0
2162,https://di.lib.vt.edu/items/show/2162,,,,,"1956-02 (photo taken)",,,,,,,,,,,,,,,,,,,,,,,"color slides",,Panama,,,,,,,,,"Virginia Polytechnic Institute and State University. University Libraries^^Virginia Polytechnic Institute and State University. University Libraries. Special Collections Department (Repository)","Estate of Leonard J. Currie","University of Panama","Panamanian^^university and college buildings^^exterior views^^Leonard J. Currie Slides^^Central America^^Panama",,"Currie, Leonard J. (Leonard James), 1913-1996 (Photographer)",,,,"de Roux & Bermudez, Architects (Architect)",http://rightsstatements.org/vocab/InC-EDU/1.0/,"Virginia Tech Libraries Special Collections^^http://aspace.lib.vt.edu/repositories/2/resources/2315",,,Image,LJC_183_012,,,,,,,,,,,,,,,,,,,,,,,,,,,,,,,,,,,,"Central America,Currie - Leonard J,de Roux & Bermudez Architects,exterior views,Leonard J. Currie Slides,Panama,Panamanian,university and college buildings",https://di.lib.vt.edu/files/original/Leonard_J._Currie_s_Slides_Collection/LJC_183_012/LJC_183_012.jpg,,Panama,1,0
2161,https://di.lib.vt.edu/items/show/2161,,,,,"1951-07 (photo taken)",,,,,,,,,,,,,,,,,,,,,,,"color slides",,Panama,,,,,,,,,"Virginia Polytechnic Institute and State University. University Libraries^^Virginia Polytechnic Institute and State University. University Libraries. Special Collections Department (Repository)","Estate of Leonard J. Currie","University of Panama Library","Panamanian^^university and college buildings^^exterior views^^Leonard J. Currie Slides^^Central America^^Panama",,"Currie, Leonard J. (Leonard James), 1913-1996 (Photographer)",,,,"de Roux & Bermudez, Architects (Architect)",http://rightsstatements.org/vocab/InC-EDU/1.0/,"Virginia Tech Libraries Special Collections^^http://aspace.lib.vt.edu/repositories/2/resources/2315",,,Image,LJC_183_011,,,,,,,,,,,,,,,,,,,,,,,,,,,,,,,,,,,,"Central America,Currie - Leonard J,de Roux & Bermudez Architects,exterior views,Leonard J. Currie Slides,Panama,Panamanian,university and college buildings",https://di.lib.vt.edu/files/original/Leonard_J._Currie_s_Slides_Collection/LJC_183_011/LJC_183_011.jpg,,Panama,1,0
2160,https://di.lib.vt.edu/items/show/2160,,,,,"1951-07 (photo taken)",,,,,,,,,,,,,,,,,,,,,,,"color slides",,Panama,,,,,,,,,"Virginia Polytechnic Institute and State University. University Libraries^^Virginia Polytechnic Institute and State University. University Libraries. Special Collections Department (Repository)","Estate of Leonard J. Currie","University of Panama","Panamanian^^university and college buildings^^exterior views^^Leonard J. Currie Slides^^Central America^^Panama",,"Currie, Leonard J. (Leonard James), 1913-1996 (Photographer)",,,,"de Roux & Bermudez, Architects (Architect)",http://rightsstatements.org/vocab/InC-EDU/1.0/,"Virginia Tech Libraries Special Collections^^http://aspace.lib.vt.edu/repositories/2/resources/2315",,,Image,LJC_183_010,,,,,,,,,,,,,,,,,,,,,,,,,,,,,,,,,,,,"Central America,Currie - Leonard J,de Roux & Bermudez Architects,exterior views,Leonard J. Currie Slides,Panama,Panamanian,university and college buildings",https://di.lib.vt.edu/files/original/Leonard_J._Currie_s_Slides_Collection/LJC_183_010/LJC_183_010.jpg,,Panama,1,0
2159,https://di.lib.vt.edu/items/show/2159,,,,,"1951-07 (photo taken)",,,,,,,,,,,,,,,,,,,,,,,"color slides",,Panama,,,,,,,,,"Virginia Polytechnic Institute and State University. University Libraries^^Virginia Polytechnic Institute and State University. University Libraries. Special Collections Department (Repository)","Estate of Leonard J. Currie","El Panama Hotel","Panamanian^^exterior views^^hotels (public accommodations)^^Leonard J. Currie Slides^^Central America^^Panama",,"Currie, Leonard J. (Leonard James), 1913-1996 (Photographer)",,,,,http://rightsstatements.org/vocab/InC-EDU/1.0/,"Virginia Tech Libraries Special Collections^^http://aspace.lib.vt.edu/repositories/2/resources/2315",,,Image,LJC_183_009,,,,,,,,,,,,,,,,,,,,,,,,,,,,,,,,,,,,"Central America,Currie - Leonard J,exterior views,hotels (public accommodations),Leonard J. Currie Slides,Panama,Panamanian",https://di.lib.vt.edu/files/original/Leonard_J._Currie_s_Slides_Collection/LJC_183_009/LJC_183_009.jpg,,Panama,1,0
2158,https://di.lib.vt.edu/items/show/2158,,,,,"1951-07 (photo taken)",,,,,,,,,,,,,,,,,,,,,,,"color slides",,Panama,,,,,,,,,"Virginia Polytechnic Institute and State University. University Libraries^^Virginia Polytechnic Institute and State University. University Libraries. Special Collections Department (Repository)","Estate of Leonard J. Currie","El Panama Hotel","Panamanian^^exterior views^^hotels (public accommodations)^^Leonard J. Currie Slides^^Central America^^Panama",,"Currie, Leonard J. (Leonard James), 1913-1996 (Photographer)",,,,,http://rightsstatements.org/vocab/InC-EDU/1.0/,"Virginia Tech Libraries Special Collections^^http://aspace.lib.vt.edu/repositories/2/resources/2315",,,Image,LJC_183_008,,,,,,,,,,,,,,,,,,,,,,,,,,,,,,,,,,,,"Central America,Currie - Leonard J,exterior views,hotels (public accommodations),Leonard J. Currie Slides,Panama,Panamanian",https://di.lib.vt.edu/files/original/Leonard_J._Currie_s_Slides_Collection/LJC_183_008/LJC_183_008.jpg,,Panama,1,0
2157,https://di.lib.vt.edu/items/show/2157,,,,,"1951-07 (photo taken)",,,,,,,,,,,,,,,,,,,,,,,"color slides",,Panama,,,,,,,,,"Virginia Polytechnic Institute and State University. University Libraries^^Virginia Polytechnic Institute and State University. University Libraries. Special Collections Department (Repository)","Estate of Leonard J. Currie","El Panama Hotel","Panamanian^^exterior views^^hotels (public accommodations)^^Leonard J. Currie Slides^^Central America^^Panama",,"Currie, Leonard J. (Leonard James), 1913-1996 (Photographer)",,,,,http://rightsstatements.org/vocab/InC-EDU/1.0/,"Virginia Tech Libraries Special Collections^^http://aspace.lib.vt.edu/repositories/2/resources/2315",,,Image,LJC_183_007,,,,,,,,,,,,,,,,,,,,,,,,,,,,,,,,,,,,"Central America,Currie - Leonard J,exterior views,hotels (public accommodations),Leonard J. Currie Slides,Panama,Panamanian",https://di.lib.vt.edu/files/original/Leonard_J._Currie_s_Slides_Collection/LJC_183_007/LJC_183_007.jpg,,Panama,1,0
2156,https://di.lib.vt.edu/items/show/2156,,,,,"1951-07 (photo taken)",,,,,,,,,,,,,,,,,,,,,,,"color slides",,Panama,,,,,,,,,"Virginia Polytechnic Institute and State University. University Libraries^^Virginia Polytechnic Institute and State University. University Libraries. Special Collections Department (Repository)","Estate of Leonard J. Currie","El Panama Hotel","Panamanian^^exterior views^^hotels (public accommodations)^^Leonard J. Currie Slides^^Central America^^Panama",,"Currie, Leonard J. (Leonard James), 1913-1996 (Photographer)",,,,,http://rightsstatements.org/vocab/InC-EDU/1.0/,"Virginia Tech Libraries Special Collections^^http://aspace.lib.vt.edu/repositories/2/resources/2315",,,Image,LJC_183_006,,,,,,,,,,,,,,,,,,,,,,,,,,,,,,,,,,,,"Central America,Currie - Leonard J,exterior views,hotels (public accommodations),Leonard J. Currie Slides,Panama,Panamanian",https://di.lib.vt.edu/files/original/Leonard_J._Currie_s_Slides_Collection/LJC_183_006/LJC_183_006.jpg,,Panama,1,0
2155,https://di.lib.vt.edu/items/show/2155,,,,,"1951-07 (photo taken)",,,,,,,,,,,,,,,,,,,,,,,"color slides",,Panama,,,,,,,,,"Virginia Polytechnic Institute and State University. University Libraries^^Virginia Polytechnic Institute and State University. University Libraries. Special Collections Department (Repository)","Estate of Leonard J. Currie","University of Panama Library","Panamanian^^Roux, Guillermo de^^university and college buildings^^exterior views^^portraits^^Leonard J. Currie Slides^^Central America^^Panama",,"Currie, Leonard J. (Leonard James), 1913-1996 (Photographer)",,,,"de Roux & Bermudez, Architects (Architect)",http://rightsstatements.org/vocab/InC-EDU/1.0/,"Virginia Tech Libraries Special Collections^^http://aspace.lib.vt.edu/repositories/2/resources/2315",,,Image,LJC_183_005,,,,,,,,,,,,,,,,,,,,,,,,,,,,,,,,,,,,"Central America,Currie - Leonard J,de Roux & Bermudez Architects,exterior views,Leonard J. Currie Slides,Panama,Panamanian,portraits,Roux, Guillermo de,university and college buildings",https://di.lib.vt.edu/files/original/Leonard_J._Currie_s_Slides_Collection/LJC_183_005/LJC_183_005.jpg,,Panama,1,0
