﻿"Item Id","Item URI","Dublin Core:Alternative Title","Dublin Core:Abstract","Dublin Core:Table Of Contents","Dublin Core:Date Available","Dublin Core:Date Created","Dublin Core:Date Accepted","Dublin Core:Date Copyrighted","Dublin Core:Date Submitted","Dublin Core:Date Issued","Dublin Core:Date Modified","Dublin Core:Date Valid","Dublin Core:Access Rights","Dublin Core:License","Dublin Core:Conforms To","Dublin Core:Has Format","Dublin Core:Has Part","Dublin Core:Has Version","Dublin Core:Is Format Of","Dublin Core:Is Part Of","Dublin Core:Is Referenced By","Dublin Core:Is Replaced By","Dublin Core:Is Required By","Dublin Core:Is Version Of","Dublin Core:References","Dublin Core:Replaces","Dublin Core:Requires","Dublin Core:Extent","Dublin Core:Medium","Dublin Core:Bibliographic Citation","Dublin Core:Spatial Coverage","Dublin Core:Temporal Coverage","Dublin Core:Accrual Method","Dublin Core:Accrual Periodicity","Dublin Core:Accrual Policy","Dublin Core:Audience","Dublin Core:Audience Education Level","Dublin Core:Mediator","Dublin Core:Instructional Method","Dublin Core:Provenance","Dublin Core:Rights Holder","Dublin Core:Title","Dublin Core:Subject","Dublin Core:Description","Dublin Core:Creator","Dublin Core:Source","Dublin Core:Publisher","Dublin Core:Date","Dublin Core:Contributor","Dublin Core:Rights","Dublin Core:Relation","Dublin Core:Format","Dublin Core:Language","Dublin Core:Type","Dublin Core:Identifier","Dublin Core:Coverage","Item Type Metadata:Text","Item Type Metadata:Interviewer","Item Type Metadata:Interviewee","Item Type Metadata:Location","Item Type Metadata:Transcription","Item Type Metadata:Local URL","Item Type Metadata:Original Format","Item Type Metadata:Physical Dimensions","Item Type Metadata:Duration","Item Type Metadata:Compression","Item Type Metadata:Producer","Item Type Metadata:Director","Item Type Metadata:Bit Rate/Frequency","Item Type Metadata:Time Summary","Item Type Metadata:Email Body","Item Type Metadata:Subject Line","Item Type Metadata:From","Item Type Metadata:To","Item Type Metadata:CC","Item Type Metadata:BCC","Item Type Metadata:Number of Attachments","Item Type Metadata:Standards","Item Type Metadata:Objectives","Item Type Metadata:Materials","Item Type Metadata:Lesson Plan Text","Item Type Metadata:URL","Item Type Metadata:Event Type","Item Type Metadata:Participants","Item Type Metadata:Birth Date","Item Type Metadata:Birthplace","Item Type Metadata:Death Date","Item Type Metadata:Occupation","Item Type Metadata:Biographical Text","Item Type Metadata:Bibliography",tags,file,itemType,collection,public,featured
478,https://di.lib.vt.edu/items/show/478,,,,,"1954 (photo taken)",,,,,,,,,,,,,,"Leonard J. Currie Slides",,,,,,,,,"color slides",,"Antioquia, Colombia",,,,,,,,,"Virginia Polytechnic Institute and State University. University Libraries^^Virginia Polytechnic Institute and State University. University Libraries. Special Collections Department (Repository)","Estate of Leonard J. Currie","WMS. BROS. Pipe Line","Colombian^^civil engineering^^Leonard J. Currie Slides^^South America^^Colombia",,"Currie, Leonard J. (Leonard James), 1913-1996 (Photographer)",,,,,http://rightsstatements.org/vocab/InC-EDU/1.0/,"Virginia Tech Libraries Special Collections^^http://aspace.lib.vt.edu/repositories/2/resources/2315",,,Image,LJC_037_001,,,,,,,,,,,,,,,,,,,,,,,,,,,,,,,,,,,,"civil engineering,Colombia,Currie - Leonard J,Leonard J. Currie Slides,South America",https://di.lib.vt.edu/files/original/Leonard_J._Currie_s_Slides_Collection/LJC_037_001/LJC_037_001.jpg,,Colombia,1,0
1925,https://di.lib.vt.edu/items/show/1925,,,,,"1973-08 (slide developed)",,,,,,,,,,,,,,,,,,,,,,,"color slides",,"Segovia, Segovia, Castilla y León, Spain",,,,,,,,,"Virginia Polytechnic Institute and State University. University Libraries^^Virginia Polytechnic Institute and State University. University Libraries. Special Collections Department (Repository)","Estate of Leonard J. Currie","Segovia Aqueduct","Spanish^^civil engineering^^aqueducts^^Imperial (Roman)^^Leonard J. Currie Slides^^Europe^^Spain",,"Currie, Leonard J. (Leonard James), 1913-1996 (Photographer)",,,,,http://rightsstatements.org/vocab/InC-EDU/1.0/,"Virginia Tech Libraries Special Collections^^http://aspace.lib.vt.edu/repositories/2/resources/2315",,,Image,LJC_105_024,,,,,,,,,,,,,,,,,,,,,,,,,,,,,,,,,,,,"aqueducts,civil engineering,Currie - Leonard J,Europe,Imperial (Roman),Leonard J. Currie Slides,Spain,Spanish",https://di.lib.vt.edu/files/original/Leonard_J._Currie_s_Slides_Collection/LJC_105_024/LJC_105_024.jpg,,Spain,1,0
1923,https://di.lib.vt.edu/items/show/1923,,,,,"1973-08 (slide developed)",,,,,,,,,,,,,,,,,,,,,,,"color slides",,"Segovia, Segovia, Castilla y León, Spain",,,,,,,,,"Virginia Polytechnic Institute and State University. University Libraries^^Virginia Polytechnic Institute and State University. University Libraries. Special Collections Department (Repository)","Estate of Leonard J. Currie","Segovia Aqueduct","Spanish^^civil engineering^^aqueducts^^Imperial (Roman)^^Leonard J. Currie Slides^^Europe^^Spain",,"Currie, Leonard J. (Leonard James), 1913-1996 (Photographer)",,,,,http://rightsstatements.org/vocab/InC-EDU/1.0/,"Virginia Tech Libraries Special Collections^^http://aspace.lib.vt.edu/repositories/2/resources/2315",,,Image,LJC_105_022,,,,,,,,,,,,,,,,,,,,,,,,,,,,,,,,,,,,"aqueducts,civil engineering,Currie - Leonard J,Europe,Imperial (Roman),Leonard J. Currie Slides,Spain,Spanish",https://di.lib.vt.edu/files/original/Leonard_J._Currie_s_Slides_Collection/LJC_105_022/LJC_105_022.jpg,,Spain,1,0
1922,https://di.lib.vt.edu/items/show/1922,,,,,"1973-08 (slide developed)",,,,,,,,,,,,,,,,,,,,,,,"color slides",,"Segovia, Segovia, Castilla y León, Spain",,,,,,,,,"Virginia Polytechnic Institute and State University. University Libraries^^Virginia Polytechnic Institute and State University. University Libraries. Special Collections Department (Repository)","Estate of Leonard J. Currie","Segovia Aqueduct","Spanish^^civil engineering^^aqueducts^^Imperial (Roman)^^Leonard J. Currie Slides^^Europe^^Spain",,"Currie, Leonard J. (Leonard James), 1913-1996 (Photographer)",,,,,http://rightsstatements.org/vocab/InC-EDU/1.0/,"Virginia Tech Libraries Special Collections^^http://aspace.lib.vt.edu/repositories/2/resources/2315",,,Image,LJC_105_021,,,,,,,,,,,,,,,,,,,,,,,,,,,,,,,,,,,,"aqueducts,civil engineering,Currie - Leonard J,Europe,Imperial (Roman),Leonard J. Currie Slides,Spain,Spanish",https://di.lib.vt.edu/files/original/Leonard_J._Currie_s_Slides_Collection/LJC_105_021/LJC_105_021.jpg,,Spain,1,0
1921,https://di.lib.vt.edu/items/show/1921,,,,,"1973-08 (slide developed)",,,,,,,,,,,,,,,,,,,,,,,"color slides",,"Segovia, Segovia, Castilla y León, Spain",,,,,,,,,"Virginia Polytechnic Institute and State University. University Libraries^^Virginia Polytechnic Institute and State University. University Libraries. Special Collections Department (Repository)","Estate of Leonard J. Currie","Segovia Aqueduct","Spanish^^civil engineering^^aqueducts^^Imperial (Roman)^^Leonard J. Currie Slides^^Europe^^Spain",,"Currie, Leonard J. (Leonard James), 1913-1996 (Photographer)",,,,,http://rightsstatements.org/vocab/InC-EDU/1.0/,"Virginia Tech Libraries Special Collections^^http://aspace.lib.vt.edu/repositories/2/resources/2315",,,Image,LJC_105_020,,,,,,,,,,,,,,,,,,,,,,,,,,,,,,,,,,,,"aqueducts,civil engineering,Currie - Leonard J,Europe,Imperial (Roman),Leonard J. Currie Slides,Spain,Spanish",https://di.lib.vt.edu/files/original/Leonard_J._Currie_s_Slides_Collection/LJC_105_020/LJC_105_020.jpg,,Spain,1,0
1920,https://di.lib.vt.edu/items/show/1920,,,,,"1973-08 (slide developed)",,,,,,,,,,,,,,,,,,,,,,,"color slides",,"Segovia, Segovia, Castilla y León, Spain",,,,,,,,,"Virginia Polytechnic Institute and State University. University Libraries^^Virginia Polytechnic Institute and State University. University Libraries. Special Collections Department (Repository)","Estate of Leonard J. Currie","Segovia Aqueduct","Spanish^^civil engineering^^aqueducts^^Imperial (Roman)^^Leonard J. Currie Slides^^Europe^^Spain",,"Currie, Leonard J. (Leonard James), 1913-1996 (Photographer)",,,,,http://rightsstatements.org/vocab/InC-EDU/1.0/,"Virginia Tech Libraries Special Collections^^http://aspace.lib.vt.edu/repositories/2/resources/2315",,,Image,LJC_105_019,,,,,,,,,,,,,,,,,,,,,,,,,,,,,,,,,,,,"aqueducts,civil engineering,Currie - Leonard J,Europe,Imperial (Roman),Leonard J. Currie Slides,Spain,Spanish",https://di.lib.vt.edu/files/original/Leonard_J._Currie_s_Slides_Collection/LJC_105_019/LJC_105_019.jpg,,Spain,1,0
1919,https://di.lib.vt.edu/items/show/1919,,,,,"1973-08 (slide developed)",,,,,,,,,,,,,,,,,,,,,,,"color slides",,"Segovia, Segovia, Castilla y León, Spain",,,,,,,,,"Virginia Polytechnic Institute and State University. University Libraries^^Virginia Polytechnic Institute and State University. University Libraries. Special Collections Department (Repository)","Estate of Leonard J. Currie","Segovia Aqueduct","Spanish^^civil engineering^^aqueducts^^Imperial (Roman)^^Leonard J. Currie Slides^^Europe^^Spain",,"Currie, Leonard J. (Leonard James), 1913-1996 (Photographer)",,,,,http://rightsstatements.org/vocab/InC-EDU/1.0/,"Virginia Tech Libraries Special Collections^^http://aspace.lib.vt.edu/repositories/2/resources/2315",,,Image,LJC_105_001,,,,,,,,,,,,,,,,,,,,,,,,,,,,,,,,,,,,"aqueducts,civil engineering,Currie - Leonard J,Europe,Imperial (Roman),Leonard J. Currie Slides,Spain,Spanish",https://di.lib.vt.edu/files/original/Leonard_J._Currie_s_Slides_Collection/LJC_105_001/LJC_105_001.jpg,,Spain,1,0
1916,https://di.lib.vt.edu/items/show/1916,,,,,"1973-04 (photo taken)",,,,,,,,,,,,,,,,,,,,,,,"color slides",,"Ronda, Málaga, Andalusia, Spain",,,,,,,,,"Virginia Polytechnic Institute and State University. University Libraries^^Virginia Polytechnic Institute and State University. University Libraries. Special Collections Department (Repository)","Estate of Leonard J. Currie","Ronda, Spain","Spanish^^bridges (built works)^^civil engineering^^Leonard J. Currie Slides^^Europe^^Spain","The box of slides is identified as Spain - Jerez, Cadiz, Vejer de la Frontera, Arcos D.L.F.A., Ubrique, Ronda.","Currie, Leonard J. (Leonard James), 1913-1996 (Photographer)",,,,,http://rightsstatements.org/vocab/InC-EDU/1.0/,"Virginia Tech Libraries Special Collections^^http://aspace.lib.vt.edu/repositories/2/resources/2315",,,Image,LJC_103_035,,,,,,,,,,,,,,,,,,,,,,,,,,,,,,,,,,,,"bridges (built works),civil engineering,Currie - Leonard J,Europe,Leonard J. Currie Slides,Spain,Spanish",https://di.lib.vt.edu/files/original/Leonard_J._Currie_s_Slides_Collection/LJC_103_035/LJC_103_035.jpg,,Spain,1,0
483,https://di.lib.vt.edu/items/show/483,,,,,"1954-07 (photo taken)",,,,,,,,,,,,,,"Leonard J. Currie Slides",,,,,,,,,"color slides",,"Cisneros, Antioquia, Colombia",,,,,,,,,"Virginia Polytechnic Institute and State University. University Libraries^^Virginia Polytechnic Institute and State University. University Libraries. Special Collections Department (Repository)","Estate of Leonard J. Currie","Pipeline near Cisneros","Colombian^^civil engineering^^Leonard J. Currie Slides^^South America^^Colombia",,"Currie, Leonard J. (Leonard James), 1913-1996 (Photographer)",,,,,http://rightsstatements.org/vocab/InC-EDU/1.0/,"Virginia Tech Libraries Special Collections^^http://aspace.lib.vt.edu/repositories/2/resources/2315",,,Image,LJC_037_007,,,,,,,,,,,,,,,,,,,,,,,,,,,,,,,,,,,,"civil engineering,Colombia,Currie - Leonard J,Leonard J. Currie Slides,South America",https://di.lib.vt.edu/files/original/Leonard_J._Currie_s_Slides_Collection/LJC_037_007/LJC_037_007.jpg,,Colombia,1,0
482,https://di.lib.vt.edu/items/show/482,,,,,"1954-07 (photo taken)",,,,,,,,,,,,,,"Leonard J. Currie Slides",,,,,,,,,"color slides",,"Cisneros, Antioquia, Colombia",,,,,,,,,"Virginia Polytechnic Institute and State University. University Libraries^^Virginia Polytechnic Institute and State University. University Libraries. Special Collections Department (Repository)","Estate of Leonard J. Currie","Pipeline near Cisneros","Colombian^^civil engineering^^Leonard J. Currie Slides^^South America^^Colombia",,"Currie, Leonard J. (Leonard James), 1913-1996 (Photographer)",,,,,http://rightsstatements.org/vocab/InC-EDU/1.0/,"Virginia Tech Libraries Special Collections^^http://aspace.lib.vt.edu/repositories/2/resources/2315",,,Image,LJC_037_005,,,,,,,,,,,,,,,,,,,,,,,,,,,,,,,,,,,,"civil engineering,Colombia,Currie - Leonard J,Leonard J. Currie Slides,South America",https://di.lib.vt.edu/files/original/Leonard_J._Currie_s_Slides_Collection/LJC_037_005/LJC_037_005.jpg,,Colombia,1,0
481,https://di.lib.vt.edu/items/show/481,,,,,"1954-07 (photo taken)",,,,,,,,,,,,,,"Leonard J. Currie Slides",,,,,,,,,"color slides",,"Cisneros, Antioquia, Colombia",,,,,,,,,"Virginia Polytechnic Institute and State University. University Libraries^^Virginia Polytechnic Institute and State University. University Libraries. Special Collections Department (Repository)","Estate of Leonard J. Currie","Pipeline near Cisneros","Colombian^^civil engineering^^Leonard J. Currie Slides^^South America^^Colombia",,"Currie, Leonard J. (Leonard James), 1913-1996 (Photographer)",,,,,http://rightsstatements.org/vocab/InC-EDU/1.0/,"Virginia Tech Libraries Special Collections^^http://aspace.lib.vt.edu/repositories/2/resources/2315",,,Image,LJC_037_004,,,,,,,,,,,,,,,,,,,,,,,,,,,,,,,,,,,,"civil engineering,Colombia,Currie - Leonard J,Leonard J. Currie Slides,South America",https://di.lib.vt.edu/files/original/Leonard_J._Currie_s_Slides_Collection/LJC_037_004/LJC_037_004.jpg,,Colombia,1,0
479,https://di.lib.vt.edu/items/show/479,,,,,"1954-07 (photo taken)",,,,,,,,,,,,,,"Leonard J. Currie Slides",,,,,,,,,"color slides",,"Cisneros, Antioquia, Colombia",,,,,,,,,"Virginia Polytechnic Institute and State University. University Libraries^^Virginia Polytechnic Institute and State University. University Libraries. Special Collections Department (Repository)","Estate of Leonard J. Currie","Pipeline near Cisneros","Colombian^^civil engineering^^Leonard J. Currie Slides^^South America^^Colombia",,"Currie, Leonard J. (Leonard James), 1913-1996 (Photographer)",,,,,http://rightsstatements.org/vocab/InC-EDU/1.0/,"Virginia Tech Libraries Special Collections^^http://aspace.lib.vt.edu/repositories/2/resources/2315",,,Image,LJC_037_002,,,,,,,,,,,,,,,,,,,,,,,,,,,,,,,,,,,,"civil engineering,Colombia,Currie - Leonard J,Leonard J. Currie Slides,South America",https://di.lib.vt.edu/files/original/Leonard_J._Currie_s_Slides_Collection/LJC_037_002/LJC_037_002.jpg,,Colombia,1,0
480,https://di.lib.vt.edu/items/show/480,,,,,"1954-07 (photo taken)",,,,,,,,,,,,,,"Leonard J. Currie Slides",,,,,,,,,"color slides",,"Cisneros, Antioquia, Colombia",,,,,,,,,"Virginia Polytechnic Institute and State University. University Libraries^^Virginia Polytechnic Institute and State University. University Libraries. Special Collections Department (Repository)","Estate of Leonard J. Currie","Pipeline job near Cisneros","Colombian^^civil engineering^^Leonard J. Currie Slides^^South America^^Colombia",,"Currie, Leonard J. (Leonard James), 1913-1996 (Photographer)",,,,,http://rightsstatements.org/vocab/InC-EDU/1.0/,"Virginia Tech Libraries Special Collections^^http://aspace.lib.vt.edu/repositories/2/resources/2315",,,Image,LJC_037_003,,,,,,,,,,,,,,,,,,,,,,,,,,,,,,,,,,,,"civil engineering,Colombia,Currie - Leonard J,Leonard J. Currie Slides,South America",https://di.lib.vt.edu/files/original/Leonard_J._Currie_s_Slides_Collection/LJC_037_003/LJC_037_003.jpg,,Colombia,1,0
