﻿"Item Id","Item URI","Dublin Core:Alternative Title","Dublin Core:Abstract","Dublin Core:Table Of Contents","Dublin Core:Date Available","Dublin Core:Date Created","Dublin Core:Date Accepted","Dublin Core:Date Copyrighted","Dublin Core:Date Submitted","Dublin Core:Date Issued","Dublin Core:Date Modified","Dublin Core:Date Valid","Dublin Core:Access Rights","Dublin Core:License","Dublin Core:Conforms To","Dublin Core:Has Format","Dublin Core:Has Part","Dublin Core:Has Version","Dublin Core:Is Format Of","Dublin Core:Is Part Of","Dublin Core:Is Referenced By","Dublin Core:Is Replaced By","Dublin Core:Is Required By","Dublin Core:Is Version Of","Dublin Core:References","Dublin Core:Replaces","Dublin Core:Requires","Dublin Core:Extent","Dublin Core:Medium","Dublin Core:Bibliographic Citation","Dublin Core:Spatial Coverage","Dublin Core:Temporal Coverage","Dublin Core:Accrual Method","Dublin Core:Accrual Periodicity","Dublin Core:Accrual Policy","Dublin Core:Audience","Dublin Core:Audience Education Level","Dublin Core:Mediator","Dublin Core:Instructional Method","Dublin Core:Provenance","Dublin Core:Rights Holder","Dublin Core:Title","Dublin Core:Subject","Dublin Core:Description","Dublin Core:Creator","Dublin Core:Source","Dublin Core:Publisher","Dublin Core:Date","Dublin Core:Contributor","Dublin Core:Rights","Dublin Core:Relation","Dublin Core:Format","Dublin Core:Language","Dublin Core:Type","Dublin Core:Identifier","Dublin Core:Coverage","Item Type Metadata:Text","Item Type Metadata:Interviewer","Item Type Metadata:Interviewee","Item Type Metadata:Location","Item Type Metadata:Transcription","Item Type Metadata:Local URL","Item Type Metadata:Original Format","Item Type Metadata:Physical Dimensions","Item Type Metadata:Duration","Item Type Metadata:Compression","Item Type Metadata:Producer","Item Type Metadata:Director","Item Type Metadata:Bit Rate/Frequency","Item Type Metadata:Time Summary","Item Type Metadata:Email Body","Item Type Metadata:Subject Line","Item Type Metadata:From","Item Type Metadata:To","Item Type Metadata:CC","Item Type Metadata:BCC","Item Type Metadata:Number of Attachments","Item Type Metadata:Standards","Item Type Metadata:Objectives","Item Type Metadata:Materials","Item Type Metadata:Lesson Plan Text","Item Type Metadata:URL","Item Type Metadata:Event Type","Item Type Metadata:Participants","Item Type Metadata:Birth Date","Item Type Metadata:Birthplace","Item Type Metadata:Death Date","Item Type Metadata:Occupation","Item Type Metadata:Biographical Text","Item Type Metadata:Bibliography",tags,file,itemType,collection,public,featured
2113,https://di.lib.vt.edu/items/show/2113,,,,,"1941 (photo taken)",,,,,,,,,,,,,,,,,,,,,,,"color slides",,"Chichicastenango, Quiché, Guatemala",,,,,,,,,"Virginia Polytechnic Institute and State University. University Libraries^^Virginia Polytechnic Institute and State University. University Libraries. Special Collections Department (Repository)","Estate of Leonard J. Currie","Chichicastenango, Guatemala","Guatemalan^^genre (visual works)^^entrances^^Leonard J. Currie Slides^^Central America^^Guatemala","Opposite the church and cofradías","Currie, Leonard J. (Leonard James), 1913-1996 (Photographer)",,,,,http://rightsstatements.org/vocab/InC-EDU/1.0/,"Virginia Tech Libraries Special Collections^^http://aspace.lib.vt.edu/repositories/2/resources/2315",,,Image,LJC_097_003,,,,,,,,,,,,,,,,,,,,,,,,,,,,,,,,,,,,"Central America,Currie - Leonard J,entrances,genre (visual works),Guatemala,Guatemalan,Leonard J. Currie Slides",https://di.lib.vt.edu/files/original/Leonard_J._Currie_s_Slides_Collection/LJC_097_003/LJC_097_003.jpg,,"Central America",1,0
2144,https://di.lib.vt.edu/items/show/2144,,,,,"1951-07 (photo taken)",,,,,,,,,,,,,,,,,,,,,,,"color slides",,"San José, San José, Costa Rica",,,,,,,,,"Virginia Polytechnic Institute and State University. University Libraries^^Virginia Polytechnic Institute and State University. University Libraries. Special Collections Department (Repository)","Estate of Leonard J. Currie","Girls in rear yard, San José, Costa Rica","Costa Rican^^genre (visual works)^^houses^^landscape gardening^^portraits^^Leonard J. Currie Slides^^Costa Rica",,"Currie, Leonard J. (Leonard James), 1913-1996 (Photographer)",,,,,http://rightsstatements.org/vocab/InC-EDU/1.0/,"Virginia Tech Libraries Special Collections^^http://aspace.lib.vt.edu/repositories/2/resources/2315",,,Image,LJC_086_003,,,,,,,,,,,,,,,,,,,,,,,,,,,,,,,,,,,,"Costa Rica,Costa Rican,Currie - Leonard J,genre (visual works),houses,landscape gardening,Leonard J. Currie Slides,portraits",https://di.lib.vt.edu/files/original/Leonard_J._Currie_s_Slides_Collection/LJC_086_003/LJC_086_003.jpg,,"Central America",1,0
498,https://di.lib.vt.edu/items/show/498,,,,,"1953-03 (photo taken)",,,,,,,,,,,,,,"Leonard J. Currie Slides",,,,,,,,,"color slides",,"Cundinamarca, Colombia",,,,,,,,,"Virginia Polytechnic Institute and State University. University Libraries^^Virginia Polytechnic Institute and State University. University Libraries. Special Collections Department (Repository)","Estate of Leonard J. Currie","La Vega, Cundinamarca, Colombia","Colombian^^genre (visual works)^^Leonard J. Currie Slides^^South America^^Colombia","Trip with Fed. Caf.","Currie, Leonard J. (Leonard James), 1913-1996 (Photographer)",,,,,http://rightsstatements.org/vocab/InC-EDU/1.0/,"Virginia Tech Libraries Special Collections^^http://aspace.lib.vt.edu/repositories/2/resources/2315",,,Image,LJC_086_035,,,,,,,,,,,,,,,,,,,,,,,,,,,,,,,,,,,,"Colombia,Currie - Leonard J,genre (visual works),Leonard J. Currie Slides,South America",https://di.lib.vt.edu/files/original/Leonard_J._Currie_s_Slides_Collection/LJC_086_035/LJC_086_035.jpg,,Colombia,1,0
499,https://di.lib.vt.edu/items/show/499,,,,,"1953-03 (photo taken)",,,,,,,,,,,,,,"Leonard J. Currie Slides",,,,,,,,,"color slides",,"Cundinamarca, Colombia",,,,,,,,,"Virginia Polytechnic Institute and State University. University Libraries^^Virginia Polytechnic Institute and State University. University Libraries. Special Collections Department (Repository)","Estate of Leonard J. Currie","La Vega, Cundinamarca, Colombia","Colombian^^genre (visual works)^^Leonard J. Currie Slides^^South America^^Colombia","Trip with Fed. Caf.","Currie, Leonard J. (Leonard James), 1913-1996 (Photographer)",,,,,http://rightsstatements.org/vocab/InC-EDU/1.0/,"Virginia Tech Libraries Special Collections^^http://aspace.lib.vt.edu/repositories/2/resources/2315",,,Image,LJC_086_036,,,,,,,,,,,,,,,,,,,,,,,,,,,,,,,,,,,,"Colombia,Currie - Leonard J,genre (visual works),Leonard J. Currie Slides,South America",https://di.lib.vt.edu/files/original/Leonard_J._Currie_s_Slides_Collection/LJC_086_036/LJC_086_036.jpg,,Colombia,1,0
500,https://di.lib.vt.edu/items/show/500,,,,,"1953-03 (photo taken)",,,,,,,,,,,,,,"Leonard J. Currie Slides",,,,,,,,,"color slides",,"Cundinamarca, Colombia",,,,,,,,,"Virginia Polytechnic Institute and State University. University Libraries^^Virginia Polytechnic Institute and State University. University Libraries. Special Collections Department (Repository)","Estate of Leonard J. Currie","La Vega, Cundinamarca, Colombia","Colombian^^bridges (built works)^^genre (visual works)^^streams^^Leonard J. Currie Slides^^South America^^Colombia",,"Currie, Leonard J. (Leonard James), 1913-1996 (Photographer)",,,,,http://rightsstatements.org/vocab/InC-EDU/1.0/,"Virginia Tech Libraries Special Collections^^http://aspace.lib.vt.edu/repositories/2/resources/2315",,,Image,LJC_086_037,,,,,,,,,,,,,,,,,,,,,,,,,,,,,,,,,,,,"bridges (built works),Colombia,Currie - Leonard J,genre (visual works),Leonard J. Currie Slides,South America,streams",https://di.lib.vt.edu/files/original/Leonard_J._Currie_s_Slides_Collection/LJC_086_037/LJC_086_037.jpg,,Colombia,1,0
496,https://di.lib.vt.edu/items/show/496,,,,,"1953-01 (photo taken)",,,,,,,,,,,,,,"Leonard J. Currie Slides",,,,,,,,,"color slides",,"Colombia^^5.542708,-72.923387",,,,,,,,,"Virginia Polytechnic Institute and State University. University Libraries^^Virginia Polytechnic Institute and State University. University Libraries. Special Collections Department (Repository)","Estate of Leonard J. Currie","Laguna de Tota","Colombian^^beaches^^genre (visual works)^^landscapes (environments)^^waterways^^lakes (bodies of water)^^Leonard J. Currie Slides^^South America^^Colombia",,"Currie, Leonard J. (Leonard James), 1913-1996 (Photographer)",,,,,http://rightsstatements.org/vocab/InC-EDU/1.0/,"Virginia Tech Libraries Special Collections^^http://aspace.lib.vt.edu/repositories/2/resources/2315",,,Image,LJC_086_028,,,,,,,,,,,,,,,,,,,,,,,,,,,,,,,,,,,,"beaches,Colombia,Currie - Leonard J,genre (visual works),lakes (bodies of water),landscapes (environments),Leonard J. Currie Slides,South America,waterways",https://di.lib.vt.edu/files/original/Leonard_J._Currie_s_Slides_Collection/LJC_086_028/LJC_086_028.jpg,,Colombia,1,0
519,https://di.lib.vt.edu/items/show/519,,,,,"1955-07 (photo taken)",,,,,,,,,,,,,,"Leonard J. Currie Slides",,,,,,,,,"color slides",,"Sogamoso, Santander, Colombia",,,,,,,,,"Virginia Polytechnic Institute and State University. University Libraries^^Virginia Polytechnic Institute and State University. University Libraries. Special Collections Department (Repository)","Estate of Leonard J. Currie","Mercado (market), Sogamoso, Boyacá Department, Colombia","Colombian^^genre (visual works)^^marketplaces^^Leonard J. Currie Slides^^South America^^Colombia",,"Currie, Leonard J. (Leonard James), 1913-1996 (Photographer)",,,,,http://rightsstatements.org/vocab/InC-EDU/1.0/,"Virginia Tech Libraries Special Collections^^http://aspace.lib.vt.edu/repositories/2/resources/2315",,,Image,LJC_086_079,,,,,,,,,,,,,,,,,,,,,,,,,,,,,,,,,,,,"Colombia,Currie - Leonard J,genre (visual works),Leonard J. Currie Slides,marketplaces,South America",https://di.lib.vt.edu/files/original/Leonard_J._Currie_s_Slides_Collection/LJC_086_079/LJC_086_079.jpg,,Colombia,1,0
521,https://di.lib.vt.edu/items/show/521,,,,,"1955-07 (photo taken)",,,,,,,,,,,,,,"Leonard J. Currie Slides",,,,,,,,,"color slides",,"Sogamoso, Boyacá, Colombia",,,,,,,,,"Virginia Polytechnic Institute and State University. University Libraries^^Virginia Polytechnic Institute and State University. University Libraries. Special Collections Department (Repository)","Estate of Leonard J. Currie","Mercado (market), Sogamoso, Boyacá Department, Colombia","Colombian^^genre (visual works)^^marketplaces^^Leonard J. Currie Slides^^South America^^Colombia",,"Currie, Leonard J. (Leonard James), 1913-1996 (Photographer)",,,,,http://rightsstatements.org/vocab/InC-EDU/1.0/,"Virginia Tech Libraries Special Collections^^http://aspace.lib.vt.edu/repositories/2/resources/2315",,,Image,LJC_086_081,,,,,,,,,,,,,,,,,,,,,,,,,,,,,,,,,,,,"Colombia,Currie - Leonard J,genre (visual works),Leonard J. Currie Slides,marketplaces,South America",https://di.lib.vt.edu/files/original/Leonard_J._Currie_s_Slides_Collection/LJC_086_081/LJC_086_081.jpg,,Colombia,1,0
2026,https://di.lib.vt.edu/items/show/2026,,,,,"1952-10 (photo taken)",,,,,,,,,,,,,,,,,,,,,,,"color slides",,"Pátzcuaro, Michoacán, Mexico",,,,,,,,,"Virginia Polytechnic Institute and State University. University Libraries^^Virginia Polytechnic Institute and State University. University Libraries. Special Collections Department (Repository)","Estate of Leonard J. Currie","Mercado, Pátzcuaro, Mexico","Mexican^^marketplaces^^genre (visual works)^^Leonard J. Currie Slides^^Mexico",,"Currie, Leonard J. (Leonard James), 1913-1996 (Photographer)",,,,,http://rightsstatements.org/vocab/InC-EDU/1.0/,"Virginia Tech Libraries Special Collections^^http://aspace.lib.vt.edu/repositories/2/resources/2315",,,Image,LJC_095_008,,,,,,,,,,,,,,,,,,,,,,,,,,,,,,,,,,,,"Currie - Leonard J,genre (visual works),Leonard J. Currie Slides,marketplaces,Mexican,Mexico",https://di.lib.vt.edu/files/original/Leonard_J._Currie_s_Slides_Collection/LJC_095_008/LJC_095_008.jpg,,Mexico,1,0
490,https://di.lib.vt.edu/items/show/490,,,,,"1952-06 (photo taken)",,,,,,,,,,,,,,"Leonard J. Currie Slides",,,,,,,,,"color slides",,Colombia,,,,,,,,,"Virginia Polytechnic Institute and State University. University Libraries^^Virginia Polytechnic Institute and State University. University Libraries. Special Collections Department (Repository)","Estate of Leonard J. Currie","Meseta de Colegio","Colombian^^genre (visual works)^^exterior views^^Leonard J. Currie Slides^^South America^^Colombia","Trip with Cafeteros","Currie, Leonard J. (Leonard James), 1913-1996 (Photographer)",,,,,http://rightsstatements.org/vocab/InC-EDU/1.0/,"Virginia Tech Libraries Special Collections^^http://aspace.lib.vt.edu/repositories/2/resources/2315",,,Image,LJC_086_022,,,,,,,,,,,,,,,,,,,,,,,,,,,,,,,,,,,,"Colombia,Currie - Leonard J,exterior views,genre (visual works),Leonard J. Currie Slides,South America",https://di.lib.vt.edu/files/original/Leonard_J._Currie_s_Slides_Collection/LJC_086_022/LJC_086_022.jpg,,Colombia,1,0
510,https://di.lib.vt.edu/items/show/510,,,,,"1954-10 (photo taken)",,,,,,,,,,,,,,"Leonard J. Currie Slides",,,,,,,,,"color slides",,"Nobsa, Boyacá, Colombia",,,,,,,,,"Virginia Polytechnic Institute and State University. University Libraries^^Virginia Polytechnic Institute and State University. University Libraries. Special Collections Department (Repository)","Estate of Leonard J. Currie","Near Nobsa, Boyacá Department, Colombia","Colombian^^genre (visual works)^^domestic animals^^landscapes (environments)^^Leonard J. Currie Slides^^South America^^Colombia",,"Currie, Leonard J. (Leonard James), 1913-1996 (Photographer)",,,,,http://rightsstatements.org/vocab/InC-EDU/1.0/,"Virginia Tech Libraries Special Collections^^http://aspace.lib.vt.edu/repositories/2/resources/2315",,,Image,LJC_086_064,,,,,,,,,,,,,,,,,,,,,,,,,,,,,,,,,,,,"Colombia,Currie - Leonard J,domestic animals,genre (visual works),landscapes (environments),Leonard J. Currie Slides,South America",https://di.lib.vt.edu/files/original/Leonard_J._Currie_s_Slides_Collection/LJC_086_064/LJC_086_064.jpg,,Colombia,1,0
1410,https://di.lib.vt.edu/items/show/1410,,,,,"1973-08 (slide developed)",,,,,,,,,,,,,,,,,,,,,,,"color slides",,Nepal,,,,,,,,,"Virginia Polytechnic Institute and State University. University Libraries^^Virginia Polytechnic Institute and State University. University Libraries. Special Collections Department (Repository)","Estate of Leonard J. Currie",Nepal,"Nepalese^^streams^^genre (visual works)^^Leonard J. Currie Slides^^Asia^^Nepal",,"Currie, Leonard J. (Leonard James), 1913-1996 (Photographer)",,,,,http://rightsstatements.org/vocab/InC-EDU/1.0/,"Virginia Tech Libraries Special Collections^^http://aspace.lib.vt.edu/repositories/2/resources/2315",,,,LJC_120_004,,,,,,,,,,,,,,,,,,,,,,,,,,,,,,,,,,,,"Asia,Currie - Leonard J,genre (visual works),Leonard J. Currie Slides,Nepal,Nepalese,streams",https://di.lib.vt.edu/files/original/19/LJC_120_004/LJC_120_004.jpg,,Nepal,1,0
1414,https://di.lib.vt.edu/items/show/1414,,,,,"1973-08 (slide developed)",,,,,,,,,,,,,,,,,,,,,,,"color slides",,Nepal,,,,,,,,,"Virginia Polytechnic Institute and State University. University Libraries^^Virginia Polytechnic Institute and State University. University Libraries. Special Collections Department (Repository)","Estate of Leonard J. Currie",Nepal,"Nepalese^^streams^^genre (visual works)^^Leonard J. Currie Slides^^Asia^^Nepal",,"Currie, Leonard J. (Leonard James), 1913-1996 (Photographer)",,,,,http://rightsstatements.org/vocab/InC-EDU/1.0/,"Virginia Tech Libraries Special Collections^^http://aspace.lib.vt.edu/repositories/2/resources/2315",,,,LJC_129_001,,,,,,,,,,,,,,,,,,,,,,,,,,,,,,,,,,,,"Asia,Currie - Leonard J,genre (visual works),Leonard J. Currie Slides,Nepal,Nepalese,streams",https://di.lib.vt.edu/files/original/19/LJC_129_001/LJC_129_001.jpg,,Nepal,1,0
1415,https://di.lib.vt.edu/items/show/1415,,,,,"1973-08 (slide developed)",,,,,,,,,,,,,,,,,,,,,,,"color slides",,Nepal,,,,,,,,,"Virginia Polytechnic Institute and State University. University Libraries^^Virginia Polytechnic Institute and State University. University Libraries. Special Collections Department (Repository)","Estate of Leonard J. Currie",Nepal,"Nepalese^^streams^^genre (visual works)^^Leonard J. Currie Slides^^Asia^^Nepal",,"Currie, Leonard J. (Leonard James), 1913-1996 (Photographer)",,,,,http://rightsstatements.org/vocab/InC-EDU/1.0/,"Virginia Tech Libraries Special Collections^^http://aspace.lib.vt.edu/repositories/2/resources/2315",,,,LJC_129_002,,,,,,,,,,,,,,,,,,,,,,,,,,,,,,,,,,,,"Asia,Currie - Leonard J,genre (visual works),Leonard J. Currie Slides,Nepal,Nepalese,streams",https://di.lib.vt.edu/files/original/19/LJC_129_002/LJC_129_002.jpg,,Nepal,1,0
1420,https://di.lib.vt.edu/items/show/1420,,,,,"1973-08 (slide developed)",,,,,,,,,,,,,,,,,,,,,,,"color slides",,Nepal,,,,,,,,,"Virginia Polytechnic Institute and State University. University Libraries^^Virginia Polytechnic Institute and State University. University Libraries. Special Collections Department (Repository)","Estate of Leonard J. Currie",Nepal,"Nepalese^^urban areas^^streams^^genre (visual works)^^Leonard J. Currie Slides^^Asia^^Nepal",,"Currie, Leonard J. (Leonard James), 1913-1996 (Photographer)",,,,,http://rightsstatements.org/vocab/InC-EDU/1.0/,"Virginia Tech Libraries Special Collections^^http://aspace.lib.vt.edu/repositories/2/resources/2315",,,,LJC_129_007,,,,,,,,,,,,,,,,,,,,,,,,,,,,,,,,,,,,"Asia,Currie - Leonard J,genre (visual works),Leonard J. Currie Slides,Nepal,Nepalese,streams,urban areas",https://di.lib.vt.edu/files/original/19/LJC_129_007/LJC_129_007.jpg,,Nepal,1,0
523,https://di.lib.vt.edu/items/show/523,,,,,"1955 (photo taken)",,,,,,,,,,,,,,"Leonard J. Currie Slides",,,,,,,,,"black-and-white transparencies",,"Boyacá, Colombia",,,,,,,,,"Virginia Polytechnic Institute and State University. University Libraries^^Virginia Polytechnic Institute and State University. University Libraries. Special Collections Department (Repository)","Estate of Leonard J. Currie","Old woman at well near steel plant, Boyacá Department, Colombia","Colombian^^genre (visual works)^^water wells^^Leonard J. Currie Slides^^South America^^Colombia",,,,,,,http://rightsstatements.org/vocab/InC-EDU/1.0/,"Virginia Tech Libraries Special Collections^^http://aspace.lib.vt.edu/repositories/2/resources/2315",,,Image,LJC_086_086,,,,,,,,,,,,,,,,,,,,,,,,,,,,,,,,,,,,"Colombia,Currie - Leonard J,genre (visual works),Leonard J. Currie Slides,South America,water wells",https://di.lib.vt.edu/files/original/Leonard_J._Currie_s_Slides_Collection/LJC_086_086/LJC_086_086.jpg,,Colombia,1,0
516,https://di.lib.vt.edu/items/show/516,,,,,"1955-04 (photo taken)",,,,,,,,,,,,,,"Leonard J. Currie Slides",,,,,,,,,"color slides",,"Sogamoso, Boyacá, Colombia",,,,,,,,,"Virginia Polytechnic Institute and State University. University Libraries^^Virginia Polytechnic Institute and State University. University Libraries. Special Collections Department (Repository)","Estate of Leonard J. Currie","Plow, Sogamoso, Boyacá Department, Colombia","Colombian^^genre (visual works)^^streets^^Leonard J. Currie Slides^^South America^^Colombia",,"Currie, Leonard J. (Leonard James), 1913-1996 (Photographer)",,,,,http://rightsstatements.org/vocab/InC-EDU/1.0/,"Virginia Tech Libraries Special Collections^^http://aspace.lib.vt.edu/repositories/2/resources/2315",,,Image,LJC_086_076,,,,,,,,,,,,,,,,,,,,,,,,,,,,,,,,,,,,"Colombia,Currie - Leonard J,genre (visual works),Leonard J. Currie Slides,South America,streets",https://di.lib.vt.edu/files/original/Leonard_J._Currie_s_Slides_Collection/LJC_086_076/LJC_086_076.jpg,,Colombia,1,0
520,https://di.lib.vt.edu/items/show/520,,,,,"1955-09 (photo taken)",,,,,,,,,,,,,,"Leonard J. Currie Slides",,,,,,,,,"color slides",,"Nobsa, Boyacá, Colombia",,,,,,,,,"Virginia Polytechnic Institute and State University. University Libraries^^Virginia Polytechnic Institute and State University. University Libraries. Special Collections Department (Repository)","Estate of Leonard J. Currie","Project, Nobsa, Boyacá Department, Colombia","Colombian^^genre (visual works)^^porches^^Leonard J. Currie Slides^^South America^^Colombia",,"Currie, Leonard J. (Leonard James), 1913-1996 (Photographer)",,,,,http://rightsstatements.org/vocab/InC-EDU/1.0/,"Virginia Tech Libraries Special Collections^^http://aspace.lib.vt.edu/repositories/2/resources/2315",,,Image,LJC_086_080,,,,,,,,,,,,,,,,,,,,,,,,,,,,,,,,,,,,"Colombia,Currie - Leonard J,genre (visual works),Leonard J. Currie Slides,porches,South America",https://di.lib.vt.edu/files/original/Leonard_J._Currie_s_Slides_Collection/LJC_086_080/LJC_086_080.jpg,,Colombia,1,0
1588,https://di.lib.vt.edu/items/show/1588,,,,,"1953-02 (photo taken)",,,,,,,,,,,,,,,,,,,,,,,"color slides",,"Rio de Janeiro, Rio de Janeiro, Sudeste, Brazil",,,,,,,,,"Virginia Polytechnic Institute and State University. University Libraries^^Virginia Polytechnic Institute and State University. University Libraries. Special Collections Department (Repository)","Estate of Leonard J. Currie","Rio de Janeiro","Brazilian^^beaches^^genre (visual works)^^Leonard J. Currie Slides^^South America^^Brazil",,"Currie, Leonard J. (Leonard James), 1913-1996 (Photographer)",,,,,http://rightsstatements.org/vocab/InC-EDU/1.0/,"Virginia Tech Libraries Special Collections^^http://aspace.lib.vt.edu/repositories/2/resources/2315",,,Image,LJC_086_041,,,,,,,,,,,,,,,,,,,,,,,,,,,,,,,,,,,,"beaches,Brazil,Brazilian,Currie - Leonard J,genre (visual works),Leonard J. Currie Slides,South America",https://di.lib.vt.edu/files/original/Leonard_J._Currie_s_Slides_Collection/LJC_086_041/LJC_086_041.jpg,,"South America",1,0
511,https://di.lib.vt.edu/items/show/511,,,,,"1955-01 (photo taken)",,,,,,,,,,,,,,"Leonard J. Currie Slides",,,,,,,,,"color slides",,"Sogamoso, Boyacá, Colombia",,,,,,,,,"Virginia Polytechnic Institute and State University. University Libraries^^Virginia Polytechnic Institute and State University. University Libraries. Special Collections Department (Repository)","Estate of Leonard J. Currie","Sogamoso Airport, Boyacá Disctirct, Colombia","Colombian^^genre (visual works)^^vehicles (transportation)^^Leonard J. Currie Slides^^South America^^Colombia",,"Currie, Leonard J. (Leonard James), 1913-1996 (Photographer)",,,,,http://rightsstatements.org/vocab/InC-EDU/1.0/,"Virginia Tech Libraries Special Collections^^http://aspace.lib.vt.edu/repositories/2/resources/2315",,,Image,LJC_086_070,,,,,,,,,,,,,,,,,,,,,,,,,,,,,,,,,,,,"Colombia,Currie - Leonard J,genre (visual works),Leonard J. Currie Slides,South America,vehicles (transportation)",https://di.lib.vt.edu/files/original/Leonard_J._Currie_s_Slides_Collection/LJC_086_070/LJC_086_070.jpg,,Colombia,1,0
