﻿"Item Id","Item URI","Dublin Core:Alternative Title","Dublin Core:Abstract","Dublin Core:Table Of Contents","Dublin Core:Date Available","Dublin Core:Date Created","Dublin Core:Date Accepted","Dublin Core:Date Copyrighted","Dublin Core:Date Submitted","Dublin Core:Date Issued","Dublin Core:Date Modified","Dublin Core:Date Valid","Dublin Core:Access Rights","Dublin Core:License","Dublin Core:Conforms To","Dublin Core:Has Format","Dublin Core:Has Part","Dublin Core:Has Version","Dublin Core:Is Format Of","Dublin Core:Is Part Of","Dublin Core:Is Referenced By","Dublin Core:Is Replaced By","Dublin Core:Is Required By","Dublin Core:Is Version Of","Dublin Core:References","Dublin Core:Replaces","Dublin Core:Requires","Dublin Core:Extent","Dublin Core:Medium","Dublin Core:Bibliographic Citation","Dublin Core:Spatial Coverage","Dublin Core:Temporal Coverage","Dublin Core:Accrual Method","Dublin Core:Accrual Periodicity","Dublin Core:Accrual Policy","Dublin Core:Audience","Dublin Core:Audience Education Level","Dublin Core:Mediator","Dublin Core:Instructional Method","Dublin Core:Provenance","Dublin Core:Rights Holder","Dublin Core:Title","Dublin Core:Subject","Dublin Core:Description","Dublin Core:Creator","Dublin Core:Source","Dublin Core:Publisher","Dublin Core:Date","Dublin Core:Contributor","Dublin Core:Rights","Dublin Core:Relation","Dublin Core:Format","Dublin Core:Language","Dublin Core:Type","Dublin Core:Identifier","Dublin Core:Coverage","Item Type Metadata:Text","Item Type Metadata:Interviewer","Item Type Metadata:Interviewee","Item Type Metadata:Location","Item Type Metadata:Transcription","Item Type Metadata:Local URL","Item Type Metadata:Original Format","Item Type Metadata:Physical Dimensions","Item Type Metadata:Duration","Item Type Metadata:Compression","Item Type Metadata:Producer","Item Type Metadata:Director","Item Type Metadata:Bit Rate/Frequency","Item Type Metadata:Time Summary","Item Type Metadata:Email Body","Item Type Metadata:Subject Line","Item Type Metadata:From","Item Type Metadata:To","Item Type Metadata:CC","Item Type Metadata:BCC","Item Type Metadata:Number of Attachments","Item Type Metadata:Standards","Item Type Metadata:Objectives","Item Type Metadata:Materials","Item Type Metadata:Lesson Plan Text","Item Type Metadata:URL","Item Type Metadata:Event Type","Item Type Metadata:Participants","Item Type Metadata:Birth Date","Item Type Metadata:Birthplace","Item Type Metadata:Death Date","Item Type Metadata:Occupation","Item Type Metadata:Biographical Text","Item Type Metadata:Bibliography",tags,file,itemType,collection,public,featured
2933,https://di.lib.vt.edu/items/show/2933,,,,,"1961-06 (photo taken)",,,,,,,,,,,,,,,,,,,"National Register Final Nomination^^Selected Modernist Architects in Virginia: Biographical Sketches By Josh Howard^^http://www.dhr.virginia.gov/registers/Counties/Montgomery/150-0019_Currie_House_1994_Final_Nomination.pdf^^http://www.dhr.virginia.gov/NewDominion/ArchitectBios_Howard_Final.pdf",,,,"color slides",,"Blacksburg, Montgomery, Virginia, United States",,,,,,,,,"Virginia Polytechnic Institute and State University. University Libraries^^Virginia Polytechnic Institute and State University. University Libraries. Special Collections Department (Repository)","Estate of Leonard J. Currie","Currie House (1961)","American^^interior views^^residential structures^^houses^^Currie House I (Blacksburg) Completed^^Leonard J. Currie Slides^^Currie House I (Blacksburg)","Currie House / Trower House / Colloquially the ""Pagoda House""","Clark, Don (Photographer)",,,,"Currie, Leonard J. (Leonard James), 1913-1996 (Architect)",http://rightsstatements.org/vocab/InC-EDU/1.0/,"Virginia Tech Libraries Special Collections^^http://aspace.lib.vt.edu/repositories/2/resources/2315",,,Image,LJC_056_012,,,,,,,,,,,,,,,,,,,,,,,,,,,,,,,,,,,,"American,Clark - Don,Currie - Leonard J,Currie House I (Blacksburg),Currie House I (Blacksburg) Completed,houses,interior views,Leonard J. Currie Slides,residential structures",https://di.lib.vt.edu/files/original/Leonard_J._Currie_s_Slides_Collection/LJC_056_012/LJC_056_012.jpg,,"United States",1,0
3204,https://di.lib.vt.edu/items/show/3204,,,,,"1961-06 (photo taken)",,,,,,,,,,,,,,,,,,,"National Register Final Nomination^^Selected Modernist Architects in Virginia: Biographical Sketches By Josh Howard^^http://www.dhr.virginia.gov/registers/Counties/Montgomery/150-0019_Currie_House_1994_Final_Nomination.pdf^^http://www.dhr.virginia.gov/NewDominion/ArchitectBios_Howard_Final.pdf",,,,"color slides",,"Blacksburg, Montgomery, Virginia, United States",,,,,,,,,"Virginia Polytechnic Institute and State University. University Libraries^^Virginia Polytechnic Institute and State University. University Libraries. Special Collections Department (Repository)","Estate of Leonard J. Currie","Currie House (1961)","American^^interior views^^residential structures^^houses^^Currie House I (Blacksburg) Completed^^Leonard J. Currie Slides^^Currie House I (Blacksburg)","Currie House / Trower House / Colloquially the ""Pagoda House""","Clark, Don (Photographer)",,,,"Currie, Leonard J. (Leonard James), 1913-1996 (Architect)",http://rightsstatements.org/vocab/InC-EDU/1.0/,"Virginia Tech Libraries Special Collections^^http://aspace.lib.vt.edu/repositories/2/resources/2315",,,Image,LJC_148_032,,,,,,,,,,,,,,,,,,,,,,,,,,,,,,,,,,,,"American,Clark - Don,Currie - Leonard J,Currie House I (Blacksburg),Currie House I (Blacksburg) Completed,houses,interior views,Leonard J. Currie Slides,residential structures",https://di.lib.vt.edu/files/original/Leonard_J._Currie_s_Slides_Collection/LJC_148_032/LJC_148_032.jpg,,"United States",1,0
3205,https://di.lib.vt.edu/items/show/3205,,,,,"1961-06 (photo taken)",,,,,,,,,,,,,,,,,,,"National Register Final Nomination^^Selected Modernist Architects in Virginia: Biographical Sketches By Josh Howard^^http://www.dhr.virginia.gov/registers/Counties/Montgomery/150-0019_Currie_House_1994_Final_Nomination.pdf^^http://www.dhr.virginia.gov/NewDominion/ArchitectBios_Howard_Final.pdf",,,,"color slides",,"Blacksburg, Montgomery, Virginia, United States",,,,,,,,,"Virginia Polytechnic Institute and State University. University Libraries^^Virginia Polytechnic Institute and State University. University Libraries. Special Collections Department (Repository)","Estate of Leonard J. Currie","Currie House (1961)","American^^interior views^^residential structures^^entrances^^houses^^Currie House I (Blacksburg) Completed^^Leonard J. Currie Slides^^Currie House I (Blacksburg)","Currie House / Trower House / Colloquially the ""Pagoda House""","Clark, Don (Photographer)",,,,"Currie, Leonard J. (Leonard James), 1913-1996 (Architect)",http://rightsstatements.org/vocab/InC-EDU/1.0/,"Virginia Tech Libraries Special Collections^^http://aspace.lib.vt.edu/repositories/2/resources/2315",,,Image,LJC_148_033,,,,,,,,,,,,,,,,,,,,,,,,,,,,,,,,,,,,"American,Clark - Don,Currie - Leonard J,Currie House I (Blacksburg),Currie House I (Blacksburg) Completed,entrances,houses,interior views,Leonard J. Currie Slides,residential structures",https://di.lib.vt.edu/files/original/Leonard_J._Currie_s_Slides_Collection/LJC_148_033/LJC_148_033.jpg,,"United States",1,0
92,https://di.lib.vt.edu/items/show/92,,,,,"1972-09 (photo taken)",,,,,,,,,,,,,,"Leonard J. Currie Slides",,,,,,,,,"color slides",,"Tokyo, Tōkyō, Kanto, Japan",,,,,,,,,"Virginia Polytechnic Institute and State University. University Libraries^^Virginia Polytechnic Institute and State University. University Libraries. Special Collections Department (Repository)","Estate of Leonard J. Currie","Tokyo Prefecture City Hall by Kenzo Tange","Japanese^^interior views^^office buildings^^Asia^^Japan",Lobby,"Currie, Leonard J. (Leonard James), 1913-1996  (Photographer)",,,,,http://rightsstatements.org/vocab/InC-EDU/1.0/,"Virginia Tech Libraries Special Collections^^http://aspace.lib.vt.edu/repositories/2/resources/2315",image/jpeg,,Image,LJC_139_052,,,,,,,,,,,,,,,,,,,,,,,,,,,,,,,,,,,,"Asia,Currie - Leonard J,interior views,Japan,Japanese,Leonard J. Currie Slides,office buildings,Tange - Kenzo",https://di.lib.vt.edu/files/original/Leonard_J._Currie_s_Slides_Collection/LJC_139_052/LJC_139_052.jpg,,Japan,1,0
95,https://di.lib.vt.edu/items/show/95,,,,,"1972-09 (photo taken)",,,,,,,,,,,,,,"Leonard J. Currie Slides",,,,,,,,,"color slides",,"Tokyo, Tōkyō, Kanto, Japan",,,,,,,,,"Virginia Polytechnic Institute and State University. University Libraries^^Virginia Polytechnic Institute and State University. University Libraries. Special Collections Department (Repository)","Estate of Leonard J. Currie","International Christian University, Gym by Akira Inadomi","Japanese^^university and college buildings^^sports buildings^^interior views^^Asia^^Japan",,"Currie, Leonard J. (Leonard James), 1913-1996  (Photographer)",,,,"Inadomi, Akira, 1927- (Architect)",http://rightsstatements.org/vocab/InC-EDU/1.0/,"Virginia Tech Libraries Special Collections^^http://aspace.lib.vt.edu/repositories/2/resources/2315",image/jpeg,,Image,LJC_139_055,,,,,,,,,,,,,,,,,,,,,,,,,,,,,,,,,,,,"Asia,Currie - Leonard J,Inadomi - Akira,interior views,Japan,Japanese,Leonard J. Currie Slides,sports buildings,university and college buildings",https://di.lib.vt.edu/files/original/Leonard_J._Currie_s_Slides_Collection/LJC_139_055/LJC_139_055.jpg,,Japan,1,0
97,https://di.lib.vt.edu/items/show/97,,,,,"1972-09 (photo taken)",,,,,,,,,,,,,,"Leonard J. Currie Slides",,,,,,,,,"color slides",,"Tokyo, Tōkyō, Kanto, Japan",,,,,,,,,"Virginia Polytechnic Institute and State University. University Libraries^^Virginia Polytechnic Institute and State University. University Libraries. Special Collections Department (Repository)","Estate of Leonard J. Currie","International Christian University, Gym by Akira Inadomi","Japanese^^university and college buildings^^sports buildings^^interior views^^Asia^^Japan",,"Currie, Leonard J. (Leonard James), 1913-1996  (Photographer)",,,,"Inadomi, Akira, 1927- (Architect)",http://rightsstatements.org/vocab/InC-EDU/1.0/,"Virginia Tech Libraries Special Collections^^http://aspace.lib.vt.edu/repositories/2/resources/2315",image/jpeg,,Image,LJC_139_057,,,,,,,,,,,,,,,,,,,,,,,,,,,,,,,,,,,,"Asia,Currie - Leonard J,Inadomi - Akira,interior views,Japan,Japanese,Leonard J. Currie Slides,sports buildings,university and college buildings",https://di.lib.vt.edu/files/original/Leonard_J._Currie_s_Slides_Collection/LJC_139_057/LJC_139_057.jpg,,Japan,1,0
101,https://di.lib.vt.edu/items/show/101,,,,,"1972-09 (photo taken)",,,,,,,,,,,,,,"Leonard J. Currie Slides",,,,,"Michio Ihara, ""International Christian University, Tokyo, Japan 1967"" and ""Biography"". michioihira.com. accessed 2018-02-07^^http://www.michioihara.com/about/biography.html^^http://www.michioihara.com/sculpture/details/1967_International_Christian_University_Tokyo_Japan.html",,,,"color slides",,"Tokyo, Tōkyō, Kanto, Japan",,,,,,,,,"Virginia Polytechnic Institute and State University. University Libraries^^Virginia Polytechnic Institute and State University. University Libraries. Special Collections Department (Repository)","Estate of Leonard J. Currie","International Christian University, Science Hall by Akira Inadomi","Japanese^^university and college buildings^^interior views^^works of art^^Asia^^Japan","Sculpture by Michio Ihara (1967)","Currie, Leonard J. (Leonard James), 1913-1996  (Photographer)",,,,"Inadomi, Akira, 1927- (Architect)^^Ihara, Michio, 1928- (Artist)",http://rightsstatements.org/vocab/InC-EDU/1.0/,"Virginia Tech Libraries Special Collections^^http://aspace.lib.vt.edu/repositories/2/resources/2315",image/jpeg,,Image,LJC_139_061,,,,,,,,,,,,,,,,,,,,,,,,,,,,,,,,,,,,"Asia,Currie - Leonard J,Ihara - Michio,Inadomi - Akira,interior views,Japan,Japanese,Leonard J. Currie Slides,university and college buildings,works of art",https://di.lib.vt.edu/files/original/Leonard_J._Currie_s_Slides_Collection/LJC_139_061/LJC_139_061.jpg,,Japan,1,0
148,https://di.lib.vt.edu/items/show/148,,,,,"1972-09 (photo taken)",,,,,,,,,,,,,,"Leonard J. Currie Slides",,,,,,,,,"color slides",,"Kyoto, Kyōto, Kinki, Japan",,,,,,,,,"Virginia Polytechnic Institute and State University. University Libraries^^Virginia Polytechnic Institute and State University. University Libraries. Special Collections Department (Repository)","Estate of Leonard J. Currie","Daitoku-ji Temple, Kyoto","Japanese^^religious complexes^^religious buildings^^interior views^^landscape gardening^^exterior views^^Asia^^Japan",,"Currie, Leonard J. (Leonard James), 1913-1996  (Photographer)",,,,,http://rightsstatements.org/vocab/InC-EDU/1.0/,"Virginia Tech Libraries Special Collections^^http://aspace.lib.vt.edu/repositories/2/resources/2315",image/jpeg,,Image,LJC_141_004,,,,,,,,,,,,,,,,,,,,,,,,,,,,,,,,,,,,"Asia,Currie - Leonard J,exterior views,interior views,Japan,Japanese,landscape gardening,Leonard J. Currie Slides,religious buildings,religious complexes",https://di.lib.vt.edu/files/original/Leonard_J._Currie_s_Slides_Collection/LJC_141_004/LJC_141_004.jpg,,Japan,1,0
149,https://di.lib.vt.edu/items/show/149,,,,,"1972-09 (photo taken)",,,,,,,,,,,,,,"Leonard J. Currie Slides",,,,,,,,,"color slides",,"Kyoto, Kyōto, Kinki, Japan",,,,,,,,,"Virginia Polytechnic Institute and State University. University Libraries^^Virginia Polytechnic Institute and State University. University Libraries. Special Collections Department (Repository)","Estate of Leonard J. Currie","Daitoku-ji Temple, Kyoto","Japanese^^religious complexes^^religious buildings^^interior views^^Asia^^Japan",,"Currie, Leonard J. (Leonard James), 1913-1996  (Photographer)",,,,,http://rightsstatements.org/vocab/InC-EDU/1.0/,"Virginia Tech Libraries Special Collections^^http://aspace.lib.vt.edu/repositories/2/resources/2315",image/jpeg,,Image,LJC_141_005,,,,,,,,,,,,,,,,,,,,,,,,,,,,,,,,,,,,"Asia,Currie - Leonard J,interior views,Japan,Japanese,Leonard J. Currie Slides,religious buildings,religious complexes",https://di.lib.vt.edu/files/original/Leonard_J._Currie_s_Slides_Collection/LJC_141_005/LJC_141_005.jpg,,Japan,1,0
167,https://di.lib.vt.edu/items/show/167,,,,,"1972-09 (photo taken)",,,,,,,,,,,,,,"Leonard J. Currie Slides",,,,,,,,,"color slides",,"Kyoto, Kyōto, Kinki, Japan",,,,,,,,,"Virginia Polytechnic Institute and State University. University Libraries^^Virginia Polytechnic Institute and State University. University Libraries. Special Collections Department (Repository)","Estate of Leonard J. Currie","Ryoan-ji Temple, Kyoto","Japanese^^religious complexes^^interior views^^religious buildings^^Asia^^Japan",,"Currie, Leonard J. (Leonard James), 1913-1996  (Photographer)",,,,,http://rightsstatements.org/vocab/InC-EDU/1.0/,"Virginia Tech Libraries Special Collections^^http://aspace.lib.vt.edu/repositories/2/resources/2315",image/jpeg,,Image,LJC_141_023,,,,,,,,,,,,,,,,,,,,,,,,,,,,,,,,,,,,"Asia,Currie - Leonard J,interior views,Japan,Japanese,Leonard J. Currie Slides,religious buildings,religious complexes",https://di.lib.vt.edu/files/original/Leonard_J._Currie_s_Slides_Collection/LJC_141_023/LJC_141_023.jpg,,Japan,1,0
177,https://di.lib.vt.edu/items/show/177,,,,,"1972-09 (photo taken)",,,,,,,,,,,,,,"Leonard J. Currie Slides",,,,,,,,,"color slides",,"Nara, Nara, Kinki, Japan",,,,,,,,,"Virginia Polytechnic Institute and State University. University Libraries^^Virginia Polytechnic Institute and State University. University Libraries. Special Collections Department (Repository)","Estate of Leonard J. Currie","Todai-ji Temple, Nara","Japanese^^interior views^^religious buildings^^works of art^^religious complexes^^Asia^^Japan",,"Currie, Leonard J. (Leonard James), 1913-1996  (Photographer)",,,,,http://rightsstatements.org/vocab/InC-EDU/1.0/,"Virginia Tech Libraries Special Collections^^http://aspace.lib.vt.edu/repositories/2/resources/2315",image/jpeg,,Image,LJC_141_033,,,,,,,,,,,,,,,,,,,,,,,,,,,,,,,,,,,,"Asia,Currie - Leonard J,interior views,Japan,Japanese,Leonard J. Currie Slides,religious buildings,religious complexes,works of art",https://di.lib.vt.edu/files/original/Leonard_J._Currie_s_Slides_Collection/LJC_141_033/LJC_141_033.jpg,,Japan,1,0
178,https://di.lib.vt.edu/items/show/178,,,,,"1972-09 (photo taken)",,,,,,,,,,,,,,"Leonard J. Currie Slides",,,,,,,,,"color slides",,"Nara, Nara, Kinki, Japan",,,,,,,,,"Virginia Polytechnic Institute and State University. University Libraries^^Virginia Polytechnic Institute and State University. University Libraries. Special Collections Department (Repository)","Estate of Leonard J. Currie","Todai-ji Temple, Nara","Japanese^^religious buildings^^interior views^^works of art^^religious complexes^^Asia^^Japan",,"Currie, Leonard J. (Leonard James), 1913-1996  (Photographer)",,,,,http://rightsstatements.org/vocab/InC-EDU/1.0/,"Virginia Tech Libraries Special Collections^^http://aspace.lib.vt.edu/repositories/2/resources/2315",image/jpeg,,Image,LJC_141_034,,,,,,,,,,,,,,,,,,,,,,,,,,,,,,,,,,,,"Asia,Currie - Leonard J,interior views,Japan,Japanese,Leonard J. Currie Slides,religious buildings,religious complexes,works of art",https://di.lib.vt.edu/files/original/Leonard_J._Currie_s_Slides_Collection/LJC_141_034/LJC_141_034.jpg,,Japan,1,0
179,https://di.lib.vt.edu/items/show/179,,,,,"1972-09 (photo taken)",,,,,,,,,,,,,,"Leonard J. Currie Slides",,,,,,,,,"color slides",,"Nara, Nara, Kinki, Japan",,,,,,,,,"Virginia Polytechnic Institute and State University. University Libraries^^Virginia Polytechnic Institute and State University. University Libraries. Special Collections Department (Repository)","Estate of Leonard J. Currie","Todai-ji Temple, Nara","Japanese^^works of art^^religious buildings^^interior views^^religious complexes^^Asia^^Japan",,"Currie, Leonard J. (Leonard James), 1913-1996  (Photographer)",,,,,http://rightsstatements.org/vocab/InC-EDU/1.0/,"Virginia Tech Libraries Special Collections^^http://aspace.lib.vt.edu/repositories/2/resources/2315",image/jpeg,,Image,LJC_141_035,,,,,,,,,,,,,,,,,,,,,,,,,,,,,,,,,,,,"Asia,Currie - Leonard J,interior views,Japan,Japanese,Leonard J. Currie Slides,religious buildings,religious complexes,works of art",https://di.lib.vt.edu/files/original/Leonard_J._Currie_s_Slides_Collection/LJC_141_035/LJC_141_035.jpg,,Japan,1,0
195,https://di.lib.vt.edu/items/show/195,,,,,"1972-09 (photo taken)",,,,,,,,,,,,,,"Leonard J. Currie Slides",,,,,,,,,"color slides",,"Kyoto, Kyōto, Kinki, Japan",,,,,,,,,"Virginia Polytechnic Institute and State University. University Libraries^^Virginia Polytechnic Institute and State University. University Libraries. Special Collections Department (Repository)","Estate of Leonard J. Currie","Katsura Imperial Villa, Kyoto","Japanese^^interior views^^palaces^^palace complexes^^Asia^^Japan",,"Currie, Leonard J. (Leonard James), 1913-1996  (Photographer)",,,,,http://rightsstatements.org/vocab/InC-EDU/1.0/,"Virginia Tech Libraries Special Collections^^http://aspace.lib.vt.edu/repositories/2/resources/2315",image/jpeg,,Image,LJC_142_016,,,,,,,,,,,,,,,,,,,,,,,,,,,,,,,,,,,,"Asia,Currie - Leonard J,interior views,Japan,Japanese,Leonard J. Currie Slides,palace complexes,palaces",https://di.lib.vt.edu/files/original/Leonard_J._Currie_s_Slides_Collection/LJC_142_016/LJC_142_016.jpg,,Japan,1,0
205,https://di.lib.vt.edu/items/show/205,,,,,"1972-09 (photo taken)",,,,,,,,,,,,,,"Leonard J. Currie Slides",,,,,,,,,"color slides",,"Kyoto, Kyōto, Kinki, Japan",,,,,,,,,"Virginia Polytechnic Institute and State University. University Libraries^^Virginia Polytechnic Institute and State University. University Libraries. Special Collections Department (Repository)","Estate of Leonard J. Currie","Katsura Imperial Villa, Kyoto","Japanese^^entrances^^interior views^^landscape gardening^^palaces^^palace complexes^^Asia^^Japan",,"Currie, Leonard J. (Leonard James), 1913-1996  (Photographer)",,,,,http://rightsstatements.org/vocab/InC-EDU/1.0/,"Virginia Tech Libraries Special Collections^^http://aspace.lib.vt.edu/repositories/2/resources/2315",image/jpeg,,Image,LJC_142_026,,,,,,,,,,,,,,,,,,,,,,,,,,,,,,,,,,,,"Asia,Currie - Leonard J,entrances,interior views,Japan,Japanese,landscape gardening,Leonard J. Currie Slides,palace complexes,palaces",https://di.lib.vt.edu/files/original/Leonard_J._Currie_s_Slides_Collection/LJC_142_026/LJC_142_026.jpg,,Japan,1,0
513,https://di.lib.vt.edu/items/show/513,,,,,"1955-08 (photo taken)",,,,,,,,,,,,,,"Leonard J. Currie Slides",,,,,,,,,"color slides",,"Paz de Río, Boyacá, Colombia",,,,,,,,,"Virginia Polytechnic Institute and State University. University Libraries^^Virginia Polytechnic Institute and State University. University Libraries. Special Collections Department (Repository)","Estate of Leonard J. Currie","Aceria (steelworks), Paz de Rio, Boyacá Department, Colombia","Colombian^^factories (structures)^^interior views^^Leonard J. Currie Slides^^South America^^Colombia",,"Currie, Leonard J. (Leonard James), 1913-1996 (Photographer)",,,,,http://rightsstatements.org/vocab/InC-EDU/1.0/,"Virginia Tech Libraries Special Collections^^http://aspace.lib.vt.edu/repositories/2/resources/2315",,,Image,LJC_086_073,,,,,,,,,,,,,,,,,,,,,,,,,,,,,,,,,,,,"Colombia,Currie - Leonard J,factories (structures),interior views,Leonard J. Currie Slides,South America",https://di.lib.vt.edu/files/original/Leonard_J._Currie_s_Slides_Collection/LJC_086_073/LJC_086_073.jpg,,Colombia,1,0
514,https://di.lib.vt.edu/items/show/514,,,,,"1955-08 (photo taken)",,,,,,,,,,,,,,"Leonard J. Currie Slides",,,,,,,,,"color slides",,"Paz de Río, Boyacá, Colombia",,,,,,,,,"Virginia Polytechnic Institute and State University. University Libraries^^Virginia Polytechnic Institute and State University. University Libraries. Special Collections Department (Repository)","Estate of Leonard J. Currie","Aceria (steelworks), Paz de Rio, Boyacá Department, Colombia","Colombian^^factories (structures)^^interior views^^Leonard J. Currie Slides^^South America^^Colombia",,"Currie, Leonard J. (Leonard James), 1913-1996 (Photographer)",,,,,http://rightsstatements.org/vocab/InC-EDU/1.0/,"Virginia Tech Libraries Special Collections^^http://aspace.lib.vt.edu/repositories/2/resources/2315",,,Image,LJC_086_074,,,,,,,,,,,,,,,,,,,,,,,,,,,,,,,,,,,,"Colombia,Currie - Leonard J,factories (structures),interior views,Leonard J. Currie Slides,South America",https://di.lib.vt.edu/files/original/Leonard_J._Currie_s_Slides_Collection/LJC_086_074/LJC_086_074.jpg,,Colombia,1,0
649,https://di.lib.vt.edu/items/show/649,,,,,"1956-07 (photo taken)",,,,,,,,,,,,,,"Leonard J. Currie Slides",,,,,,,,,"color slides",,"Cartagena, Bolívar, Colombia",,,,,,,,,"Virginia Polytechnic Institute and State University. University Libraries^^Virginia Polytechnic Institute and State University. University Libraries. Special Collections Department (Repository)","Estate of Leonard J. Currie","Cartagena, Colombia","Colombian^^entrances^^interior views^^Leonard J. Currie Slides^^South America^^Colombia",,"Currie, Leonard J. (Leonard James), 1913-1996 (Photographer)",,,,,http://rightsstatements.org/vocab/InC-EDU/1.0/,"Virginia Tech Libraries Special Collections^^http://aspace.lib.vt.edu/repositories/2/resources/2315",,,Image,LJC_101_012,,,,,,,,,,,,,,,,,,,,,,,,,,,,,,,,,,,,"Colombia,Currie - Leonard J,entrances,interior views,Leonard J. Currie Slides,South America",https://di.lib.vt.edu/files/original/Leonard_J._Currie_s_Slides_Collection/LJC_101_012/LJC_101_012.jpg,,Colombia,1,0