﻿"Item Id","Item URI","Dublin Core:Alternative Title","Dublin Core:Abstract","Dublin Core:Table Of Contents","Dublin Core:Date Available","Dublin Core:Date Created","Dublin Core:Date Accepted","Dublin Core:Date Copyrighted","Dublin Core:Date Submitted","Dublin Core:Date Issued","Dublin Core:Date Modified","Dublin Core:Date Valid","Dublin Core:Access Rights","Dublin Core:License","Dublin Core:Conforms To","Dublin Core:Has Format","Dublin Core:Has Part","Dublin Core:Has Version","Dublin Core:Is Format Of","Dublin Core:Is Part Of","Dublin Core:Is Referenced By","Dublin Core:Is Replaced By","Dublin Core:Is Required By","Dublin Core:Is Version Of","Dublin Core:References","Dublin Core:Replaces","Dublin Core:Requires","Dublin Core:Extent","Dublin Core:Medium","Dublin Core:Bibliographic Citation","Dublin Core:Spatial Coverage","Dublin Core:Temporal Coverage","Dublin Core:Accrual Method","Dublin Core:Accrual Periodicity","Dublin Core:Accrual Policy","Dublin Core:Audience","Dublin Core:Audience Education Level","Dublin Core:Mediator","Dublin Core:Instructional Method","Dublin Core:Provenance","Dublin Core:Rights Holder","Dublin Core:Title","Dublin Core:Subject","Dublin Core:Description","Dublin Core:Creator","Dublin Core:Source","Dublin Core:Publisher","Dublin Core:Date","Dublin Core:Contributor","Dublin Core:Rights","Dublin Core:Relation","Dublin Core:Format","Dublin Core:Language","Dublin Core:Type","Dublin Core:Identifier","Dublin Core:Coverage","Item Type Metadata:Text","Item Type Metadata:Interviewer","Item Type Metadata:Interviewee","Item Type Metadata:Location","Item Type Metadata:Transcription","Item Type Metadata:Local URL","Item Type Metadata:Original Format","Item Type Metadata:Physical Dimensions","Item Type Metadata:Duration","Item Type Metadata:Compression","Item Type Metadata:Producer","Item Type Metadata:Director","Item Type Metadata:Bit Rate/Frequency","Item Type Metadata:Time Summary","Item Type Metadata:Email Body","Item Type Metadata:Subject Line","Item Type Metadata:From","Item Type Metadata:To","Item Type Metadata:CC","Item Type Metadata:BCC","Item Type Metadata:Number of Attachments","Item Type Metadata:Standards","Item Type Metadata:Objectives","Item Type Metadata:Materials","Item Type Metadata:Lesson Plan Text","Item Type Metadata:URL","Item Type Metadata:Event Type","Item Type Metadata:Participants","Item Type Metadata:Birth Date","Item Type Metadata:Birthplace","Item Type Metadata:Death Date","Item Type Metadata:Occupation","Item Type Metadata:Biographical Text","Item Type Metadata:Bibliography",tags,file,itemType,collection,public,featured
3103,https://di.lib.vt.edu/items/show/3103,,,,,"1981-06 (photo taken)",,,,,,,,,,,,,,,,,,,,,,,"color slides",,"Blacksburg, Montgomery, Virginia, United States",,,,,,,,,"Virginia Polytechnic Institute and State University. University Libraries^^Virginia Polytechnic Institute and State University. University Libraries. Special Collections Department (Repository)","Estate of Leonard J. Currie","Adger S. Johnson House","American^^exterior views^^landscape gardening^^residential structures^^houses^^Leonard J. Currie Slides^^Currie Projects^^Johnson House",,"Currie, Leonard J. (Leonard James), 1913-1996 (Photographer)",,,,"Currie, Leonard J. (Leonard James), 1913-1996 (Architect)",http://rightsstatements.org/vocab/InC-EDU/1.0/,"Virginia Tech Libraries Special Collections^^http://aspace.lib.vt.edu/repositories/2/resources/2315",,,Image,LJC_127_006,,,,,,,,,,,,,,,,,,,,,,,,,,,,,,,,,,,,"American,Currie - Leonard J,Currie Projects,exterior views,houses,Johnson House,landscape gardening,Leonard J. Currie Slides,residential structures",https://di.lib.vt.edu/files/original/Leonard_J._Currie_s_Slides_Collection/LJC_127_006/LJC_127_006.jpg,,"United States",1,0
3104,https://di.lib.vt.edu/items/show/3104,,,,,"1981-06 (photo taken)",,,,,,,,,,,,,,,,,,,,,,,"color slides",,"Blacksburg, Montgomery, Virginia, United States",,,,,,,,,"Virginia Polytechnic Institute and State University. University Libraries^^Virginia Polytechnic Institute and State University. University Libraries. Special Collections Department (Repository)","Estate of Leonard J. Currie","Adger S. Johnson House","American^^exterior views^^landscape gardening^^residential structures^^entrances^^houses^^Leonard J. Currie Slides^^Currie Projects^^Johnson House",,"Currie, Leonard J. (Leonard James), 1913-1996 (Photographer)",,,,"Currie, Leonard J. (Leonard James), 1913-1996 (Architect)",http://rightsstatements.org/vocab/InC-EDU/1.0/,"Virginia Tech Libraries Special Collections^^http://aspace.lib.vt.edu/repositories/2/resources/2315",,,Image,LJC_127_007,,,,,,,,,,,,,,,,,,,,,,,,,,,,,,,,,,,,"American,Currie - Leonard J,Currie Projects,entrances,exterior views,houses,Johnson House,landscape gardening,Leonard J. Currie Slides,residential structures",https://di.lib.vt.edu/files/original/Leonard_J._Currie_s_Slides_Collection/LJC_127_007/LJC_127_007.jpg,,"United States",1,0
1878,https://di.lib.vt.edu/items/show/1878,,,,,"1973-05 (photo taken)",,,,,,,,,,,,,,,,,,,,,,,"color slides",,"Granada, Andalusia, Spain",,,,,,,,,"Virginia Polytechnic Institute and State University. University Libraries^^Virginia Polytechnic Institute and State University. University Libraries. Special Collections Department (Repository)","Estate of Leonard J. Currie","Alhambra, Granada, Spain","Spanish^^palaces^^palace complexes^^courtyards^^landscape gardening^^Spanish and North African Islamic styles and periods^^Leonard J. Currie Slides^^Europe^^Spain",,"Currie, Leonard J. (Leonard James), 1913-1996 (Photographer)",,,,,http://rightsstatements.org/vocab/InC-EDU/1.0/,"Virginia Tech Libraries Special Collections^^http://aspace.lib.vt.edu/repositories/2/resources/2315",,,Image,LJC_104_009,,,,,,,,,,,,,,,,,,,,,,,,,,,,,,,,,,,,"courtyards,Currie - Leonard J,Europe,landscape gardening,Leonard J. Currie Slides,palace complexes,palaces,Spain,Spanish,Spanish and North African Islamic styles and periods",https://di.lib.vt.edu/files/original/Leonard_J._Currie_s_Slides_Collection/LJC_104_009/LJC_104_009.jpg,,Spain,1,0
1879,https://di.lib.vt.edu/items/show/1879,,,,,"1973-05 (photo taken)",,,,,,,,,,,,,,,,,,,,,,,"color slides",,"Granada, Andalusia, Spain",,,,,,,,,"Virginia Polytechnic Institute and State University. University Libraries^^Virginia Polytechnic Institute and State University. University Libraries. Special Collections Department (Repository)","Estate of Leonard J. Currie","Alhambra, Granada, Spain","Spanish^^palaces^^palace complexes^^courtyards^^landscape gardening^^Spanish and North African Islamic styles and periods^^Leonard J. Currie Slides^^Europe^^Spain",,"Currie, Leonard J. (Leonard James), 1913-1996 (Photographer)",,,,,http://rightsstatements.org/vocab/InC-EDU/1.0/,"Virginia Tech Libraries Special Collections^^http://aspace.lib.vt.edu/repositories/2/resources/2315",,,Image,LJC_104_010,,,,,,,,,,,,,,,,,,,,,,,,,,,,,,,,,,,,"courtyards,Currie - Leonard J,Europe,landscape gardening,Leonard J. Currie Slides,palace complexes,palaces,Spain,Spanish,Spanish and North African Islamic styles and periods",https://di.lib.vt.edu/files/original/Leonard_J._Currie_s_Slides_Collection/LJC_104_010/LJC_104_010.jpg,,Spain,1,0
1881,https://di.lib.vt.edu/items/show/1881,,,,,"1973-05 (photo taken)",,,,,,,,,,,,,,,,,,,,,,,"color slides",,"Granada, Andalusia, Spain",,,,,,,,,"Virginia Polytechnic Institute and State University. University Libraries^^Virginia Polytechnic Institute and State University. University Libraries. Special Collections Department (Repository)","Estate of Leonard J. Currie","Alhambra, Granada, Spain","Spanish^^palaces^^palace complexes^^courtyards^^landscape gardening^^Spanish and North African Islamic styles and periods^^Leonard J. Currie Slides^^Europe^^Spain",,"Currie, Leonard J. (Leonard James), 1913-1996 (Photographer)",,,,,http://rightsstatements.org/vocab/InC-EDU/1.0/,"Virginia Tech Libraries Special Collections^^http://aspace.lib.vt.edu/repositories/2/resources/2315",,,Image,LJC_104_012,,,,,,,,,,,,,,,,,,,,,,,,,,,,,,,,,,,,"courtyards,Currie - Leonard J,Europe,landscape gardening,Leonard J. Currie Slides,palace complexes,palaces,Spain,Spanish,Spanish and North African Islamic styles and periods",https://di.lib.vt.edu/files/original/Leonard_J._Currie_s_Slides_Collection/LJC_104_012/LJC_104_012.jpg,,Spain,1,0
1889,https://di.lib.vt.edu/items/show/1889,,,,,"1973-05 (photo taken)",,,,,,,,,,,,,,,,,,,,,,,"color slides",,"Granada, Andalusia, Spain",,,,,,,,,"Virginia Polytechnic Institute and State University. University Libraries^^Virginia Polytechnic Institute and State University. University Libraries. Special Collections Department (Repository)","Estate of Leonard J. Currie","Alhambra, Granada, Spain","Spanish^^palaces^^palace complexes^^landscape gardening^^Spanish and North African Islamic styles and periods^^Leonard J. Currie Slides^^Europe^^Spain",,"Currie, Leonard J. (Leonard James), 1913-1996 (Photographer)",,,,,http://rightsstatements.org/vocab/InC-EDU/1.0/,"Virginia Tech Libraries Special Collections^^http://aspace.lib.vt.edu/repositories/2/resources/2315",,,Image,LJC_104_020,,,,,,,,,,,,,,,,,,,,,,,,,,,,,,,,,,,,"Currie - Leonard J,Europe,landscape gardening,Leonard J. Currie Slides,palace complexes,palaces,Spain,Spanish,Spanish and North African Islamic styles and periods",https://di.lib.vt.edu/files/original/Leonard_J._Currie_s_Slides_Collection/LJC_104_020/LJC_104_020.jpg,,Spain,1,0
1890,https://di.lib.vt.edu/items/show/1890,,,,,"1973-05 (photo taken)",,,,,,,,,,,,,,,,,,,,,,,"color slides",,"Granada, Andalusia, Spain",,,,,,,,,"Virginia Polytechnic Institute and State University. University Libraries^^Virginia Polytechnic Institute and State University. University Libraries. Special Collections Department (Repository)","Estate of Leonard J. Currie","Alhambra, Granada, Spain","Spanish^^palaces^^palace complexes^^landscape gardening^^Spanish and North African Islamic styles and periods^^Leonard J. Currie Slides^^Europe^^Spain",,"Currie, Leonard J. (Leonard James), 1913-1996 (Photographer)",,,,,http://rightsstatements.org/vocab/InC-EDU/1.0/,"Virginia Tech Libraries Special Collections^^http://aspace.lib.vt.edu/repositories/2/resources/2315",,,Image,LJC_104_021,,,,,,,,,,,,,,,,,,,,,,,,,,,,,,,,,,,,"Currie - Leonard J,Europe,landscape gardening,Leonard J. Currie Slides,palace complexes,palaces,Spain,Spanish,Spanish and North African Islamic styles and periods",https://di.lib.vt.edu/files/original/Leonard_J._Currie_s_Slides_Collection/LJC_104_021/LJC_104_021.jpg,,Spain,1,0
1894,https://di.lib.vt.edu/items/show/1894,,,,,"1973-05 (photo taken)",,,,,,,,,,,,,,,,,,,,,,,"color slides",,"Granada, Andalusia, Spain",,,,,,,,,"Virginia Polytechnic Institute and State University. University Libraries^^Virginia Polytechnic Institute and State University. University Libraries. Special Collections Department (Repository)","Estate of Leonard J. Currie","Alhambra, Granada, Spain","Spanish^^palaces^^palace complexes^^fountains^^landscape gardening^^Spanish and North African Islamic styles and periods^^Leonard J. Currie Slides^^Europe^^Spain",,"Currie, Leonard J. (Leonard James), 1913-1996 (Photographer)",,,,,http://rightsstatements.org/vocab/InC-EDU/1.0/,"Virginia Tech Libraries Special Collections^^http://aspace.lib.vt.edu/repositories/2/resources/2315",,,Image,LJC_104_025,,,,,,,,,,,,,,,,,,,,,,,,,,,,,,,,,,,,"Currie - Leonard J,Europe,fountains,landscape gardening,Leonard J. Currie Slides,palace complexes,palaces,Spain,Spanish,Spanish and North African Islamic styles and periods",https://di.lib.vt.edu/files/original/Leonard_J._Currie_s_Slides_Collection/LJC_104_025/LJC_104_025.jpg,,Spain,1,0
1895,https://di.lib.vt.edu/items/show/1895,,,,,"1973-05 (photo taken)",,,,,,,,,,,,,,,,,,,,,,,"color slides",,"Granada, Andalusia, Spain",,,,,,,,,"Virginia Polytechnic Institute and State University. University Libraries^^Virginia Polytechnic Institute and State University. University Libraries. Special Collections Department (Repository)","Estate of Leonard J. Currie","Alhambra, Granada, Spain","Spanish^^palaces^^palace complexes^^landscape gardening^^Spanish and North African Islamic styles and periods^^Leonard J. Currie Slides^^Europe^^Spain",,"Currie, Leonard J. (Leonard James), 1913-1996 (Photographer)",,,,,http://rightsstatements.org/vocab/InC-EDU/1.0/,"Virginia Tech Libraries Special Collections^^http://aspace.lib.vt.edu/repositories/2/resources/2315",,,Image,LJC_104_026,,,,,,,,,,,,,,,,,,,,,,,,,,,,,,,,,,,,"Currie - Leonard J,Europe,landscape gardening,Leonard J. Currie Slides,palace complexes,palaces,Spain,Spanish,Spanish and North African Islamic styles and periods",https://di.lib.vt.edu/files/original/Leonard_J._Currie_s_Slides_Collection/LJC_104_026/LJC_104_026.jpg,,Spain,1,0
1897,https://di.lib.vt.edu/items/show/1897,,,,,"1973-05 (photo taken)",,,,,,,,,,,,,,,,,,,,,,,"color slides",,"Granada, Andalusia, Spain",,,,,,,,,"Virginia Polytechnic Institute and State University. University Libraries^^Virginia Polytechnic Institute and State University. University Libraries. Special Collections Department (Repository)","Estate of Leonard J. Currie","Alhambra, Granada, Spain","Spanish^^palaces^^palace complexes^^courtyards^^landscape gardening^^fountains^^Spanish and North African Islamic styles and periods^^Leonard J. Currie Slides^^Europe^^Spain",,"Currie, Leonard J. (Leonard James), 1913-1996 (Photographer)",,,,,http://rightsstatements.org/vocab/InC-EDU/1.0/,"Virginia Tech Libraries Special Collections^^http://aspace.lib.vt.edu/repositories/2/resources/2315",,,Image,LJC_104_028,,,,,,,,,,,,,,,,,,,,,,,,,,,,,,,,,,,,"courtyards,Currie - Leonard J,Europe,fountains,landscape gardening,Leonard J. Currie Slides,palace complexes,palaces,Spain,Spanish,Spanish and North African Islamic styles and periods",https://di.lib.vt.edu/files/original/Leonard_J._Currie_s_Slides_Collection/LJC_104_028/LJC_104_028.jpg,,Spain,1,0
1898,https://di.lib.vt.edu/items/show/1898,,,,,"1973-05 (photo taken)",,,,,,,,,,,,,,,,,,,,,,,"color slides",,"Granada, Andalusia, Spain",,,,,,,,,"Virginia Polytechnic Institute and State University. University Libraries^^Virginia Polytechnic Institute and State University. University Libraries. Special Collections Department (Repository)","Estate of Leonard J. Currie","Alhambra, Granada, Spain","Spanish^^palaces^^palace complexes^^fountains^^landscape gardening^^Spanish and North African Islamic styles and periods^^Leonard J. Currie Slides^^Europe^^Spain",,"Currie, Leonard J. (Leonard James), 1913-1996 (Photographer)",,,,,http://rightsstatements.org/vocab/InC-EDU/1.0/,"Virginia Tech Libraries Special Collections^^http://aspace.lib.vt.edu/repositories/2/resources/2315",,,Image,LJC_104_029,,,,,,,,,,,,,,,,,,,,,,,,,,,,,,,,,,,,"Currie - Leonard J,Europe,fountains,landscape gardening,Leonard J. Currie Slides,palace complexes,palaces,Spain,Spanish,Spanish and North African Islamic styles and periods",https://di.lib.vt.edu/files/original/Leonard_J._Currie_s_Slides_Collection/LJC_104_029/LJC_104_029.jpg,,Spain,1,0
2143,https://di.lib.vt.edu/items/show/2143,,,,,"1951-07 (photo taken)",,,,,,,,,,,,,,,,,,,,,,,"color slides",,"San José, San José, Costa Rica",,,,,,,,,"Virginia Polytechnic Institute and State University. University Libraries^^Virginia Polytechnic Institute and State University. University Libraries. Special Collections Department (Repository)","Estate of Leonard J. Currie","Backyard in a slum, El Cremetario, near San José, Costa Rica","Costa Rican^^houses^^landscape gardening^^Leonard J. Currie Slides^^Costa Rica",,"Currie, Leonard J. (Leonard James), 1913-1996 (Photographer)",,,,,http://rightsstatements.org/vocab/InC-EDU/1.0/,"Virginia Tech Libraries Special Collections^^http://aspace.lib.vt.edu/repositories/2/resources/2315",,,Image,LJC_086_002,,,,,,,,,,,,,,,,,,,,,,,,,,,,,,,,,,,,"Costa Rica,Costa Rican,Currie - Leonard J,houses,landscape gardening,Leonard J. Currie Slides",https://di.lib.vt.edu/files/original/Leonard_J._Currie_s_Slides_Collection/LJC_086_002/LJC_086_002.jpg,,"Central America",1,0
1658,https://di.lib.vt.edu/items/show/1658,,,,,"1973-07 (slide developed)",,,,,,,,,,,,,,,,,,,,,,,"color slides",,Belgium,,,,,,,,,"Virginia Polytechnic Institute and State University. University Libraries^^Virginia Polytechnic Institute and State University. University Libraries. Special Collections Department (Repository)","Estate of Leonard J. Currie",Belgium,"Belgian (region)^^landscape gardening^^Leonard J. Currie Slides^^Europe^^Belgium",,"Currie, Leonard J. (Leonard James), 1913-1996 (Photographer)",,,,,http://rightsstatements.org/vocab/InC-EDU/1.0/,"Virginia Tech Libraries Special Collections^^http://aspace.lib.vt.edu/repositories/2/resources/2315",,,Image,LJC_137_055,,,,,,,,,,,,,,,,,,,,,,,,,,,,,,,,,,,,"Belgian (region),Belgium,Currie - Leonard J,Europe,landscape gardening,Leonard J. Currie Slides",https://di.lib.vt.edu/files/original/Leonard_J._Currie_s_Slides_Collection/LJC_137_055/LJC_137_055.jpg,,Europe,1,0
1665,https://di.lib.vt.edu/items/show/1665,,,,,"1973-07 (slide developed)",,,,,,,,,,,,,,,,,,,,,,,"color slides",,Belgium,,,,,,,,,"Virginia Polytechnic Institute and State University. University Libraries^^Virginia Polytechnic Institute and State University. University Libraries. Special Collections Department (Repository)","Estate of Leonard J. Currie",Belgium,"Belgian (region)^^open spaces^^landscape gardening^^exterior views^^residential structures^^Leonard J. Currie Slides^^Europe^^Belgium",,"Currie, Leonard J. (Leonard James), 1913-1996 (Photographer)",,,,,http://rightsstatements.org/vocab/InC-EDU/1.0/,"Virginia Tech Libraries Special Collections^^http://aspace.lib.vt.edu/repositories/2/resources/2315",,,Image,LJC_137_062,,,,,,,,,,,,,,,,,,,,,,,,,,,,,,,,,,,,"Belgian (region),Belgium,Currie - Leonard J,Europe,exterior views,landscape gardening,Leonard J. Currie Slides,open spaces,residential structures",https://di.lib.vt.edu/files/original/Leonard_J._Currie_s_Slides_Collection/LJC_137_062/LJC_137_062.jpg,,Europe,1,0
3101,https://di.lib.vt.edu/items/show/3101,,,,,"1961 (photo taken)",,,,,,,,,,,,,,,,,,,,,,,"color slides",,"Blacksburg, Montgomery, Virginia, United States",,,,,,,,,"Virginia Polytechnic Institute and State University. University Libraries^^Virginia Polytechnic Institute and State University. University Libraries. Special Collections Department (Repository)","Estate of Leonard J. Currie","Bradley House","American^^exterior views^^landscape gardening^^residential structures^^houses^^Leonard J. Currie Slides^^Currie Projects^^Bradley House",,"Currie, Leonard J. (Leonard James), 1913-1996 (Photographer)",,,,"Currie, Leonard J. (Leonard James), 1913-1996 (Architect)",http://rightsstatements.org/vocab/InC-EDU/1.0/,"Virginia Tech Libraries Special Collections^^http://aspace.lib.vt.edu/repositories/2/resources/2315",,,Image,LJC_127_004,,,,,,,,,,,,,,,,,,,,,,,,,,,,,,,,,,,,"American,Bradley House,Currie - Leonard J,Currie Projects,exterior views,houses,landscape gardening,Leonard J. Currie Slides,residential structures",https://di.lib.vt.edu/files/original/Leonard_J._Currie_s_Slides_Collection/LJC_127_004/LJC_127_004.jpg,,"United States",1,0
608,https://di.lib.vt.edu/items/show/608,,,,,"1967-12 (slide developed)",,,,,,,,,,,,,,"Leonard J. Currie Slides",,,,,,,,,"color slides",,Colombia,,,,,,,,,"Virginia Polytechnic Institute and State University. University Libraries^^Virginia Polytechnic Institute and State University. University Libraries. Special Collections Department (Repository)","Estate of Leonard J. Currie",Colombia,"Colombian^^landscape gardening^^Leonard J. Currie Slides^^South America^^Colombia","The box of slides is labeled Colomba. Tenza and air views--Cauca Valley, Shabana de Bogota, etc.","Currie, Leonard J. (Leonard James), 1913-1996 (Photographer)",,,,,http://rightsstatements.org/vocab/InC-EDU/1.0/,"Virginia Tech Libraries Special Collections^^http://aspace.lib.vt.edu/repositories/2/resources/2315",,,Image,LJC_094_009,,,,,,,,,,,,,,,,,,,,,,,,,,,,,,,,,,,,"Colombia,Currie - Leonard J,landscape gardening,Leonard J. Currie Slides,South America",https://di.lib.vt.edu/files/original/Leonard_J._Currie_s_Slides_Collection/LJC_094_009/LJC_094_009.jpg,,Colombia,1,0
610,https://di.lib.vt.edu/items/show/610,,,,,"1967-12 (slide developed)",,,,,,,,,,,,,,"Leonard J. Currie Slides",,,,,,,,,"color slides",,Colombia,,,,,,,,,"Virginia Polytechnic Institute and State University. University Libraries^^Virginia Polytechnic Institute and State University. University Libraries. Special Collections Department (Repository)","Estate of Leonard J. Currie",Colombia,"Colombian^^landscape gardening^^Leonard J. Currie Slides^^South America^^Colombia","The box of slides is labeled Colomba. Tenza and air views--Cauca Valley, Shabana de Bogota, etc.","Currie, Leonard J. (Leonard James), 1913-1996 (Photographer)",,,,,http://rightsstatements.org/vocab/InC-EDU/1.0/,"Virginia Tech Libraries Special Collections^^http://aspace.lib.vt.edu/repositories/2/resources/2315",,,Image,LJC_094_011,,,,,,,,,,,,,,,,,,,,,,,,,,,,,,,,,,,,"Colombia,Currie - Leonard J,landscape gardening,Leonard J. Currie Slides,South America",https://di.lib.vt.edu/files/original/Leonard_J._Currie_s_Slides_Collection/LJC_094_011/LJC_094_011.jpg,,Colombia,1,0
2859,https://di.lib.vt.edu/items/show/2859,,,,,"1984-05 (photo taken)",,,,,,,,,,,,,,,,,,,"National Register Final Nomination^^Selected Modernist Architects in Virginia: Biographical Sketches By Josh Howard^^http://www.dhr.virginia.gov/registers/Counties/Montgomery/150-0019_Currie_House_1994_Final_Nomination.pdf^^http://www.dhr.virginia.gov/NewDominion/ArchitectBios_Howard_Final.pdf",,,,"color slides",,"Blacksburg, Montgomery, Virginia, United States",,,,,,,,,"Virginia Polytechnic Institute and State University. University Libraries^^Virginia Polytechnic Institute and State University. University Libraries. Special Collections Department (Repository)","Estate of Leonard J. Currie","Currie House (1961)","American^^exterior views^^landscape gardening^^residential structures^^entrances^^houses^^Currie House I (Blacksburg) Completed^^Leonard J. Currie Slides^^Currie House I (Blacksburg)","Currie House / Trower House / Colloquially the ""Pagoda House""","Currie, Leonard J. (Leonard James), 1913-1996 (Photographer)",,,,"Currie, Leonard J. (Leonard James), 1913-1996 (Architect)",http://rightsstatements.org/vocab/InC-EDU/1.0/,"Virginia Tech Libraries Special Collections^^http://aspace.lib.vt.edu/repositories/2/resources/2315",,,Image,LJC_056_015,,,,,,,,,,,,,,,,,,,,,,,,,,,,,,,,,,,,"American,Currie - Leonard J,Currie House I (Blacksburg),Currie House I (Blacksburg) Completed,entrances,exterior views,houses,landscape gardening,Leonard J. Currie Slides,residential structures",https://di.lib.vt.edu/files/original/Leonard_J._Currie_s_Slides_Collection/LJC_056_015/LJC_056_015.jpg,,"United States",1,0