﻿"Item Id","Item URI","Dublin Core:Alternative Title","Dublin Core:Abstract","Dublin Core:Table Of Contents","Dublin Core:Date Available","Dublin Core:Date Created","Dublin Core:Date Accepted","Dublin Core:Date Copyrighted","Dublin Core:Date Submitted","Dublin Core:Date Issued","Dublin Core:Date Modified","Dublin Core:Date Valid","Dublin Core:Access Rights","Dublin Core:License","Dublin Core:Conforms To","Dublin Core:Has Format","Dublin Core:Has Part","Dublin Core:Has Version","Dublin Core:Is Format Of","Dublin Core:Is Part Of","Dublin Core:Is Referenced By","Dublin Core:Is Replaced By","Dublin Core:Is Required By","Dublin Core:Is Version Of","Dublin Core:References","Dublin Core:Replaces","Dublin Core:Requires","Dublin Core:Extent","Dublin Core:Medium","Dublin Core:Bibliographic Citation","Dublin Core:Spatial Coverage","Dublin Core:Temporal Coverage","Dublin Core:Accrual Method","Dublin Core:Accrual Periodicity","Dublin Core:Accrual Policy","Dublin Core:Audience","Dublin Core:Audience Education Level","Dublin Core:Mediator","Dublin Core:Instructional Method","Dublin Core:Provenance","Dublin Core:Rights Holder","Dublin Core:Title","Dublin Core:Subject","Dublin Core:Description","Dublin Core:Creator","Dublin Core:Source","Dublin Core:Publisher","Dublin Core:Date","Dublin Core:Contributor","Dublin Core:Rights","Dublin Core:Relation","Dublin Core:Format","Dublin Core:Language","Dublin Core:Type","Dublin Core:Identifier","Dublin Core:Coverage","Item Type Metadata:Text","Item Type Metadata:Interviewer","Item Type Metadata:Interviewee","Item Type Metadata:Location","Item Type Metadata:Transcription","Item Type Metadata:Local URL","Item Type Metadata:Original Format","Item Type Metadata:Physical Dimensions","Item Type Metadata:Duration","Item Type Metadata:Compression","Item Type Metadata:Producer","Item Type Metadata:Director","Item Type Metadata:Bit Rate/Frequency","Item Type Metadata:Time Summary","Item Type Metadata:Email Body","Item Type Metadata:Subject Line","Item Type Metadata:From","Item Type Metadata:To","Item Type Metadata:CC","Item Type Metadata:BCC","Item Type Metadata:Number of Attachments","Item Type Metadata:Standards","Item Type Metadata:Objectives","Item Type Metadata:Materials","Item Type Metadata:Lesson Plan Text","Item Type Metadata:URL","Item Type Metadata:Event Type","Item Type Metadata:Participants","Item Type Metadata:Birth Date","Item Type Metadata:Birthplace","Item Type Metadata:Death Date","Item Type Metadata:Occupation","Item Type Metadata:Biographical Text","Item Type Metadata:Bibliography",tags,file,itemType,collection,public,featured
2204,https://di.lib.vt.edu/items/show/2204,,,,,"1952-02 (photo taken)",,,,,,,,,,,,,,,,,,,,,,,"color slides",,"Panamá, Panamá, Provincia de, Panama",,,,,,,,,"Virginia Polytechnic Institute and State University. University Libraries^^Virginia Polytechnic Institute and State University. University Libraries. Special Collections Department (Repository)","Estate of Leonard J. Currie","Panama City and the Pacific end of the Panama Canal","Panamanian^^aerial photographs^^landscapes (environments)^^waterways^^harbors^^oceans^^Leonard J. Currie Slides^^Central America^^Panama",,"Currie, Leonard J. (Leonard James), 1913-1996 (Photographer)",,,,,http://rightsstatements.org/vocab/InC-EDU/1.0/,"Virginia Tech Libraries Special Collections^^http://aspace.lib.vt.edu/repositories/2/resources/2315",,,Image,LJC_183_051,,,,,,,,,,,,,,,,,,,,,,,,,,,,,,,,,,,,"aerial photographs,Central America,Currie - Leonard J,harbors,landscapes (environments),Leonard J. Currie Slides,oceans,Panama,Panamanian,waterways",https://di.lib.vt.edu/files/original/Leonard_J._Currie_s_Slides_Collection/LJC_183_051/LJC_183_051.jpg,,Panama,1,0
2203,https://di.lib.vt.edu/items/show/2203,,,,,"1951-07 (photo taken)",,,,,,,,,,,,,,,,,,,,,,,"color slides",,"Panamá, Panamá, Provincia de, Panama",,,,,,,,,"Virginia Polytechnic Institute and State University. University Libraries^^Virginia Polytechnic Institute and State University. University Libraries. Special Collections Department (Repository)","Estate of Leonard J. Currie","Native huts near Tocumen Airport","Panamanian^^aerial photographs^^landscapes (environments)^^Leonard J. Currie Slides^^Central America^^Panama",,"Currie, Leonard J. (Leonard James), 1913-1996 (Photographer)",,,,,http://rightsstatements.org/vocab/InC-EDU/1.0/,"Virginia Tech Libraries Special Collections^^http://aspace.lib.vt.edu/repositories/2/resources/2315",,,Image,LJC_183_034,,,,,,,,,,,,,,,,,,,,,,,,,,,,,,,,,,,,"aerial photographs,Central America,Currie - Leonard J,landscapes (environments),Leonard J. Currie Slides,Panama,Panamanian",https://di.lib.vt.edu/files/original/Leonard_J._Currie_s_Slides_Collection/LJC_183_034/LJC_183_034.jpg,,Panama,1,0
2202,https://di.lib.vt.edu/items/show/2202,,,,,"1951-07 (photo taken)",,,,,,,,,,,,,,,,,,,,,,,"color slides",,"Panamá, Panamá, Provincia de, Panama",,,,,,,,,"Virginia Polytechnic Institute and State University. University Libraries^^Virginia Polytechnic Institute and State University. University Libraries. Special Collections Department (Repository)","Estate of Leonard J. Currie","Pacific shore near Tocumen Airport","Panamanian^^aerial photographs^^landscapes (environments)^^Leonard J. Currie Slides^^Central America^^Panama",,"Currie, Leonard J. (Leonard James), 1913-1996 (Photographer)",,,,,http://rightsstatements.org/vocab/InC-EDU/1.0/,"Virginia Tech Libraries Special Collections^^http://aspace.lib.vt.edu/repositories/2/resources/2315",,,Image,LJC_183_033,,,,,,,,,,,,,,,,,,,,,,,,,,,,,,,,,,,,"aerial photographs,Central America,Currie - Leonard J,landscapes (environments),Leonard J. Currie Slides,Panama,Panamanian",https://di.lib.vt.edu/files/original/Leonard_J._Currie_s_Slides_Collection/LJC_183_033/LJC_183_033.jpg,,Panama,1,0
2193,https://di.lib.vt.edu/items/show/2193,,,,,"1951-07 (photo taken)",,,,,,,,,,,,,,,,,,,,,,,"color slides",,"Panamá, Canal de, Panama",,,,,,,,,"Virginia Polytechnic Institute and State University. University Libraries^^Virginia Polytechnic Institute and State University. University Libraries. Special Collections Department (Repository)","Estate of Leonard J. Currie","Pacific end of the Panama Canal","Panamanian^^aerial photographs^^landscapes (environments)^^Leonard J. Currie Slides^^Central America^^Panama",,"Currie, Leonard J. (Leonard James), 1913-1996 (Photographer)",,,,,http://rightsstatements.org/vocab/InC-EDU/1.0/,"Virginia Tech Libraries Special Collections^^http://aspace.lib.vt.edu/repositories/2/resources/2315",,,Image,LJC_183_032,,,,,,,,,,,,,,,,,,,,,,,,,,,,,,,,,,,,"aerial photographs,Central America,Currie - Leonard J,landscapes (environments),Leonard J. Currie Slides,Panama,Panamanian",https://di.lib.vt.edu/files/original/Leonard_J._Currie_s_Slides_Collection/LJC_183_032/LJC_183_032.jpg,,Panama,1,0
2192,https://di.lib.vt.edu/items/show/2192,,,,,"1951-07 (photo taken)",,,,,,,,,,,,,,,,,,,,,,,"color slides",,"Panamá, Canal de, Panama",,,,,,,,,"Virginia Polytechnic Institute and State University. University Libraries^^Virginia Polytechnic Institute and State University. University Libraries. Special Collections Department (Repository)","Estate of Leonard J. Currie","Pacific end of the Panama Canal","Panamanian^^waterways^^aerial photographs^^landscapes (environments)^^oceans^^canals (waterways)^^Leonard J. Currie Slides^^Central America^^Panama",,"Currie, Leonard J. (Leonard James), 1913-1996 (Photographer)",,,,,http://rightsstatements.org/vocab/InC-EDU/1.0/,"Virginia Tech Libraries Special Collections^^http://aspace.lib.vt.edu/repositories/2/resources/2315",,,Image,LJC_183_031,,,,,,,,,,,,,,,,,,,,,,,,,,,,,,,,,,,,"aerial photographs,canals (waterways),Central America,Currie - Leonard J,landscapes (environments),Leonard J. Currie Slides,oceans,Panama,Panamanian,waterways",https://di.lib.vt.edu/files/original/Leonard_J._Currie_s_Slides_Collection/LJC_183_031/LJC_183_031.jpg,,Panama,1,0
2182,https://di.lib.vt.edu/items/show/2182,,,,,"1952-01 (photo taken)",,,,,,,,,,,,,,,,,,,,,,,"color slides",,Panama,,,,,,,,,"Virginia Polytechnic Institute and State University. University Libraries^^Virginia Polytechnic Institute and State University. University Libraries. Special Collections Department (Repository)","Estate of Leonard J. Currie","Grace Line - N.Y. to B.V. - approach to Panama","Panamanian^^landscapes (environments)^^watercraft^^waterways^^seas^^Leonard J. Currie Slides^^Central America^^Panama",,"Currie, Leonard J. (Leonard James), 1913-1996 (Photographer)",,,,,http://rightsstatements.org/vocab/InC-EDU/1.0/,"Virginia Tech Libraries Special Collections^^http://aspace.lib.vt.edu/repositories/2/resources/2315",,,Image,LJC_183_054,,,,,,,,,,,,,,,,,,,,,,,,,,,,,,,,,,,,"Central America,Currie - Leonard J,landscapes (environments),Leonard J. Currie Slides,Panama,Panamanian,seas,watercraft,waterways",https://di.lib.vt.edu/files/original/Leonard_J._Currie_s_Slides_Collection/LJC_183_054/LJC_183_054.jpg,,Panama,1,0
2181,https://di.lib.vt.edu/items/show/2181,,,,,"1951-07 (photo taken)",,,,,,,,,,,,,,,,,,,,,,,"color slides",,Panama,,,,,,,,,"Virginia Polytechnic Institute and State University. University Libraries^^Virginia Polytechnic Institute and State University. University Libraries. Special Collections Department (Repository)","Estate of Leonard J. Currie",Panama,"Panamanian^^aerial photographs^^landscapes (environments)^^Leonard J. Currie Slides^^Central America^^Panama",,"Currie, Leonard J. (Leonard James), 1913-1996 (Photographer)",,,,,http://rightsstatements.org/vocab/InC-EDU/1.0/,"Virginia Tech Libraries Special Collections^^http://aspace.lib.vt.edu/repositories/2/resources/2315",,,Image,LJC_183_049,,,,,,,,,,,,,,,,,,,,,,,,,,,,,,,,,,,,"aerial photographs,Central America,Currie - Leonard J,landscapes (environments),Leonard J. Currie Slides,Panama,Panamanian",https://di.lib.vt.edu/files/original/Leonard_J._Currie_s_Slides_Collection/LJC_183_049/LJC_183_049.jpg,,Panama,1,0
2180,https://di.lib.vt.edu/items/show/2180,,,,,"1951-07 (photo taken)",,,,,,,,,,,,,,,,,,,,,,,"color slides",,Panama,,,,,,,,,"Virginia Polytechnic Institute and State University. University Libraries^^Virginia Polytechnic Institute and State University. University Libraries. Special Collections Department (Repository)","Estate of Leonard J. Currie",Panama,"Panamanian^^aerial photographs^^landscapes (environments)^^Leonard J. Currie Slides^^Central America^^Panama",,"Currie, Leonard J. (Leonard James), 1913-1996 (Photographer)",,,,,http://rightsstatements.org/vocab/InC-EDU/1.0/,"Virginia Tech Libraries Special Collections^^http://aspace.lib.vt.edu/repositories/2/resources/2315",,,Image,LJC_183_048,,,,,,,,,,,,,,,,,,,,,,,,,,,,,,,,,,,,"aerial photographs,Central America,Currie - Leonard J,landscapes (environments),Leonard J. Currie Slides,Panama,Panamanian",https://di.lib.vt.edu/files/original/Leonard_J._Currie_s_Slides_Collection/LJC_183_048/LJC_183_048.jpg,,Panama,1,0
2165,https://di.lib.vt.edu/items/show/2165,,,,,"1952-01 (photo taken)",,,,,,,,,,,,,,,,,,,,,,,"color slides",,Panama,,,,,,,,,"Virginia Polytechnic Institute and State University. University Libraries^^Virginia Polytechnic Institute and State University. University Libraries. Special Collections Department (Repository)","Estate of Leonard J. Currie","Grace Line - N.Y. to B.V. - islands of Panama, Pacific side","Panamanian^^waterways^^landscapes (environments)^^watercraft^^oceans^^Leonard J. Currie Slides^^Central America^^Panama",,"Currie, Leonard J. (Leonard James), 1913-1996 (Photographer)",,,,,http://rightsstatements.org/vocab/InC-EDU/1.0/,"Virginia Tech Libraries Special Collections^^http://aspace.lib.vt.edu/repositories/2/resources/2315",,,Image,LJC_183_025,,,,,,,,,,,,,,,,,,,,,,,,,,,,,,,,,,,,"Central America,Currie - Leonard J,landscapes (environments),Leonard J. Currie Slides,oceans,Panama,Panamanian,watercraft,waterways",https://di.lib.vt.edu/files/original/Leonard_J._Currie_s_Slides_Collection/LJC_183_025/LJC_183_025.jpg,,Panama,1,0
2150,https://di.lib.vt.edu/items/show/2150,,,,,"1951-07 (photo taken)",,,,,,,,,,,,,,,,,,,,,,,"color slides",,"San Juan, San Juan, Puerto Rico",,,,,,,,,"Virginia Polytechnic Institute and State University. University Libraries^^Virginia Polytechnic Institute and State University. University Libraries. Special Collections Department (Repository)","Estate of Leonard J. Currie","From Condado Beach, San Juan, Puerto Rico","Puerto Rican^^landscapes (environments)^^waterways^^seas^^Leonard J. Currie Slides^^Caribbean^^Puerto Rico","Caribe-Hilton beyond","Currie, Leonard J. (Leonard James), 1913-1996 (Photographer)",,,,,http://rightsstatements.org/vocab/InC-EDU/1.0/,"Virginia Tech Libraries Special Collections^^http://aspace.lib.vt.edu/repositories/2/resources/2315",,,Image,LJC_086_004,,,,,,,,,,,,,,,,,,,,,,,,,,,,,,,,,,,,"Caribbean,Currie - Leonard J,landscapes (environments),Leonard J. Currie Slides,Puerto Rican,Puerto Rico,seas,waterways",https://di.lib.vt.edu/files/original/Leonard_J._Currie_s_Slides_Collection/LJC_086_004/LJC_086_004.jpg,,"Central America",1,0
2141,https://di.lib.vt.edu/items/show/2141,,,,,"1952-02 (photo taken)",,,,,,,,,,,,,,,,,,,,,,,"color slides",,"Irazú, Volcán, Costa Rica",,,,,,,,,"Virginia Polytechnic Institute and State University. University Libraries^^Virginia Polytechnic Institute and State University. University Libraries. Special Collections Department (Repository)","Estate of Leonard J. Currie","Irazú Volcano, Costa Rica","Costa Rican^^landscapes (environments)^^Leonard J. Currie Slides^^Costa Rica",,"Currie, Leonard J. (Leonard James), 1913-1996 (Photographer)",,,,,http://rightsstatements.org/vocab/InC-EDU/1.0/,"Virginia Tech Libraries Special Collections^^http://aspace.lib.vt.edu/repositories/2/resources/2315",,,Image,LJC_086_020,,,,,,,,,,,,,,,,,,,,,,,,,,,,,,,,,,,,"Costa Rica,Costa Rican,Currie - Leonard J,landscapes (environments),Leonard J. Currie Slides",https://di.lib.vt.edu/files/original/Leonard_J._Currie_s_Slides_Collection/LJC_086_020/LJC_086_020.jpg,,"Central America",1,0
2120,https://di.lib.vt.edu/items/show/2120,,,,,"1956-07 (photo taken)",,,,,,,,,,,,,,,,,,,,,,,"color slides",,"Port-au-Prince, Ouest, Haiti",,,,,,,,,"Virginia Polytechnic Institute and State University. University Libraries^^Virginia Polytechnic Institute and State University. University Libraries. Special Collections Department (Repository)","Estate of Leonard J. Currie","View of Port-au-Prince, Haiti","Haitian^^urban areas^^waterways^^landscapes (environments)^^seas^^Leonard J. Currie Slides^^Caribbean^^Haiti",,"Currie, Leonard J. (Leonard James), 1913-1996 (Photographer)",,,,,http://rightsstatements.org/vocab/InC-EDU/1.0/,"Virginia Tech Libraries Special Collections^^http://aspace.lib.vt.edu/repositories/2/resources/2315",,,Image,LJC_098_004,,,,,,,,,,,,,,,,,,,,,,,,,,,,,,,,,,,,"Caribbean,Currie - Leonard J,Haiti,Haitian,landscapes (environments),Leonard J. Currie Slides,seas,urban areas,waterways",https://di.lib.vt.edu/files/original/Leonard_J._Currie_s_Slides_Collection/LJC_098_004/LJC_098_004.jpg,,"Central America",1,0
2119,https://di.lib.vt.edu/items/show/2119,,,,,"1956-07 (photo taken)",,,,,,,,,,,,,,,,,,,,,,,"color slides",,"Port-au-Prince, Ouest, Haiti",,,,,,,,,"Virginia Polytechnic Institute and State University. University Libraries^^Virginia Polytechnic Institute and State University. University Libraries. Special Collections Department (Repository)","Estate of Leonard J. Currie","Musicians and View of Port-au-Prince, Haiti","Haitian^^street entertainers^^landscapes (environments)^^urban areas^^Leonard J. Currie Slides^^Caribbean^^Haiti",,"Currie, Leonard J. (Leonard James), 1913-1996 (Photographer)",,,,,http://rightsstatements.org/vocab/InC-EDU/1.0/,"Virginia Tech Libraries Special Collections^^http://aspace.lib.vt.edu/repositories/2/resources/2315",,,Image,LJC_098_003,,,,,,,,,,,,,,,,,,,,,,,,,,,,,,,,,,,,"Caribbean,Currie - Leonard J,Haiti,Haitian,landscapes (environments),Leonard J. Currie Slides,street entertainers,urban areas",https://di.lib.vt.edu/files/original/Leonard_J._Currie_s_Slides_Collection/LJC_098_003/LJC_098_003.jpg,,"Central America",1,0
2115,https://di.lib.vt.edu/items/show/2115,,,,,"1951-09 (photo taken)",,,,,,,,,,,,,,,,,,,,,,,"color slides",,"Managua, Lago de, Nicaragua",,,,,,,,,"Virginia Polytechnic Institute and State University. University Libraries^^Virginia Polytechnic Institute and State University. University Libraries. Special Collections Department (Repository)","Estate of Leonard J. Currie","Distant View of Managua across Lake Managua, Nicaragua","Nicaraguan^^aerial photographs^^landscapes (environments)^^urban areas^^waterways^^lakes (bodies of water)^^Leonard J. Currie Slides^^Central America^^Nicaragua",,"Currie, Leonard J. (Leonard James), 1913-1996 (Photographer)",,,,,http://rightsstatements.org/vocab/InC-EDU/1.0/,"Virginia Tech Libraries Special Collections^^http://aspace.lib.vt.edu/repositories/2/resources/2315",,,Image,LJC_086_010,,,,,,,,,,,,,,,,,,,,,,,,,,,,,,,,,,,,"aerial photographs,Central America,Currie - Leonard J,lakes (bodies of water),landscapes (environments),Leonard J. Currie Slides,Nicaragua,Nicaraguan,urban areas,waterways",https://di.lib.vt.edu/files/original/Leonard_J._Currie_s_Slides_Collection/LJC_086_010/LJC_086_010.jpg,,"Central America",1,0
2099,https://di.lib.vt.edu/items/show/2099,,,,,"1965-07 (photo taken)",,,,,,,,,,,,,,,,,,,,,,,"color slides",,"Rabinal, Baja Verapaz, Guatemala",,,,,,,,,"Virginia Polytechnic Institute and State University. University Libraries^^Virginia Polytechnic Institute and State University. University Libraries. Special Collections Department (Repository)","Estate of Leonard J. Currie","Rabinal, Guatemala","Guatemalan^^aerial photographs^^landscapes (environments)^^urban areas^^Leonard J. Currie Slides^^Central America^^Guatemala","Air view","Currie, Leonard J. (Leonard James), 1913-1996 (Photographer)",,,,,http://rightsstatements.org/vocab/InC-EDU/1.0/,"Virginia Tech Libraries Special Collections^^http://aspace.lib.vt.edu/repositories/2/resources/2315",,,Image,LJC_018_007,,,,,,,,,,,,,,,,,,,,,,,,,,,,,,,,,,,,"aerial photographs,Central America,Currie - Leonard J,Guatemala,Guatemalan,landscapes (environments),Leonard J. Currie Slides,urban areas",https://di.lib.vt.edu/files/original/Leonard_J._Currie_s_Slides_Collection/LJC_018_007/LJC_018_007.jpg,,"Central America",1,0
2077,https://di.lib.vt.edu/items/show/2077,,,,,"1951-09 (photo taken)",,,,,,,,,,,,,,,,,,,,,,,"color slides",,Guatemala,,,,,,,,,"Virginia Polytechnic Institute and State University. University Libraries^^Virginia Polytechnic Institute and State University. University Libraries. Special Collections Department (Repository)","Estate of Leonard J. Currie","Small town in Guatemala","Guatemalan^^aerial photographs^^landscapes (environments)^^urban areas^^Leonard J. Currie Slides^^Central America^^Guatemala",,"Currie, Leonard J. (Leonard James), 1913-1996 (Photographer)",,,,,http://rightsstatements.org/vocab/InC-EDU/1.0/,"Virginia Tech Libraries Special Collections^^http://aspace.lib.vt.edu/repositories/2/resources/2315",,,Image,LJC_097_016,,,,,,,,,,,,,,,,,,,,,,,,,,,,,,,,,,,,"aerial photographs,Central America,Currie - Leonard J,Guatemala,Guatemalan,landscapes (environments),Leonard J. Currie Slides,urban areas",https://di.lib.vt.edu/files/original/Leonard_J._Currie_s_Slides_Collection/LJC_097_016/LJC_097_016.jpg,,"Central America",1,0
2059,https://di.lib.vt.edu/items/show/2059,,,,,"1951-09 (photo taken)",,,,,,,,,,,,,,,,,,,,,,,"color slides",,"Mexico City, Distrito Federal, Mexico",,,,,,,,,"Virginia Polytechnic Institute and State University. University Libraries^^Virginia Polytechnic Institute and State University. University Libraries. Special Collections Department (Repository)","Estate of Leonard J. Currie","Village near Mexico City","Mexican^^aerial photographs^^landscapes (environments)^^urban areas^^Leonard J. Currie Slides^^Mexico",,"Currie, Leonard J. (Leonard James), 1913-1996 (Photographer)",,,,,http://rightsstatements.org/vocab/InC-EDU/1.0/,"Virginia Tech Libraries Special Collections^^http://aspace.lib.vt.edu/repositories/2/resources/2315",,,Image,LJC_097_015,,,,,,,,,,,,,,,,,,,,,,,,,,,,,,,,,,,,"aerial photographs,Currie - Leonard J,landscapes (environments),Leonard J. Currie Slides,Mexican,Mexico,urban areas",https://di.lib.vt.edu/files/original/Leonard_J._Currie_s_Slides_Collection/LJC_097_015/LJC_097_015.jpg,,Mexico,1,0
2058,https://di.lib.vt.edu/items/show/2058,,,,,"1951-09 (photo taken)",,,,,,,,,,,,,,,,,,,,,,,"color slides",,"Mexico City, Distrito Federal, Mexico",,,,,,,,,"Virginia Polytechnic Institute and State University. University Libraries^^Virginia Polytechnic Institute and State University. University Libraries. Special Collections Department (Repository)","Estate of Leonard J. Currie","Village near Mexico City","Mexican^^aerial photographs^^landscapes (environments)^^urban areas^^Leonard J. Currie Slides^^Mexico",,"Currie, Leonard J. (Leonard James), 1913-1996 (Photographer)",,,,,http://rightsstatements.org/vocab/InC-EDU/1.0/,"Virginia Tech Libraries Special Collections^^http://aspace.lib.vt.edu/repositories/2/resources/2315",,,Image,LJC_097_014,,,,,,,,,,,,,,,,,,,,,,,,,,,,,,,,,,,,"aerial photographs,Currie - Leonard J,landscapes (environments),Leonard J. Currie Slides,Mexican,Mexico,urban areas",https://di.lib.vt.edu/files/original/Leonard_J._Currie_s_Slides_Collection/LJC_097_014/LJC_097_014.jpg,,Mexico,1,0
2057,https://di.lib.vt.edu/items/show/2057,,,,,"1951-09 (photo taken)",,,,,,,,,,,,,,,,,,,,,,,"color slides",,"Mexico City, Distrito Federal, Mexico",,,,,,,,,"Virginia Polytechnic Institute and State University. University Libraries^^Virginia Polytechnic Institute and State University. University Libraries. Special Collections Department (Repository)","Estate of Leonard J. Currie","Village pattern near Mexico City","Mexican^^aerial photographs^^landscapes (environments)^^urban areas^^Leonard J. Currie Slides^^Mexico",,"Currie, Leonard J. (Leonard James), 1913-1996 (Photographer)",,,,,http://rightsstatements.org/vocab/InC-EDU/1.0/,"Virginia Tech Libraries Special Collections^^http://aspace.lib.vt.edu/repositories/2/resources/2315",,,Image,LJC_097_001,,,,,,,,,,,,,,,,,,,,,,,,,,,,,,,,,,,,"aerial photographs,Currie - Leonard J,landscapes (environments),Leonard J. Currie Slides,Mexican,Mexico,urban areas",https://di.lib.vt.edu/files/original/Leonard_J._Currie_s_Slides_Collection/LJC_097_001/LJC_097_001.jpg,,Mexico,1,0
2046,https://di.lib.vt.edu/items/show/2046,,,,,"1952-10 (photo taken)",,,,,,,,,,,,,,,,,,,,,,,"color slides",,"Janitzio, Isla de, Michoacán, Mexico",,,,,,,,,"Virginia Polytechnic Institute and State University. University Libraries^^Virginia Polytechnic Institute and State University. University Libraries. Special Collections Department (Repository)","Estate of Leonard J. Currie","Janitzio, Mexico","Mexican^^waterways^^landscapes (environments)^^lakes (bodies of water)^^Leonard J. Currie Slides^^Mexico",,"Currie, Leonard J. (Leonard James), 1913-1996 (Photographer)",,,,,http://rightsstatements.org/vocab/InC-EDU/1.0/,"Virginia Tech Libraries Special Collections^^http://aspace.lib.vt.edu/repositories/2/resources/2315",,,Image,LJC_095_010,,,,,,,,,,,,,,,,,,,,,,,,,,,,,,,,,,,,"Currie - Leonard J,lakes (bodies of water),landscapes (environments),Leonard J. Currie Slides,Mexican,Mexico,waterways",https://di.lib.vt.edu/files/original/Leonard_J._Currie_s_Slides_Collection/LJC_095_010/LJC_095_010.jpg,,Mexico,1,0
