﻿"Item Id","Item URI","Dublin Core:Alternative Title","Dublin Core:Abstract","Dublin Core:Table Of Contents","Dublin Core:Date Available","Dublin Core:Date Created","Dublin Core:Date Accepted","Dublin Core:Date Copyrighted","Dublin Core:Date Submitted","Dublin Core:Date Issued","Dublin Core:Date Modified","Dublin Core:Date Valid","Dublin Core:Access Rights","Dublin Core:License","Dublin Core:Conforms To","Dublin Core:Has Format","Dublin Core:Has Part","Dublin Core:Has Version","Dublin Core:Is Format Of","Dublin Core:Is Part Of","Dublin Core:Is Referenced By","Dublin Core:Is Replaced By","Dublin Core:Is Required By","Dublin Core:Is Version Of","Dublin Core:References","Dublin Core:Replaces","Dublin Core:Requires","Dublin Core:Extent","Dublin Core:Medium","Dublin Core:Bibliographic Citation","Dublin Core:Spatial Coverage","Dublin Core:Temporal Coverage","Dublin Core:Accrual Method","Dublin Core:Accrual Periodicity","Dublin Core:Accrual Policy","Dublin Core:Audience","Dublin Core:Audience Education Level","Dublin Core:Mediator","Dublin Core:Instructional Method","Dublin Core:Provenance","Dublin Core:Rights Holder","Dublin Core:Title","Dublin Core:Subject","Dublin Core:Description","Dublin Core:Creator","Dublin Core:Source","Dublin Core:Publisher","Dublin Core:Date","Dublin Core:Contributor","Dublin Core:Rights","Dublin Core:Relation","Dublin Core:Format","Dublin Core:Language","Dublin Core:Type","Dublin Core:Identifier","Dublin Core:Coverage","Item Type Metadata:Text","Item Type Metadata:Interviewer","Item Type Metadata:Interviewee","Item Type Metadata:Location","Item Type Metadata:Transcription","Item Type Metadata:Local URL","Item Type Metadata:Original Format","Item Type Metadata:Physical Dimensions","Item Type Metadata:Duration","Item Type Metadata:Compression","Item Type Metadata:Producer","Item Type Metadata:Director","Item Type Metadata:Bit Rate/Frequency","Item Type Metadata:Time Summary","Item Type Metadata:Email Body","Item Type Metadata:Subject Line","Item Type Metadata:From","Item Type Metadata:To","Item Type Metadata:CC","Item Type Metadata:BCC","Item Type Metadata:Number of Attachments","Item Type Metadata:Standards","Item Type Metadata:Objectives","Item Type Metadata:Materials","Item Type Metadata:Lesson Plan Text","Item Type Metadata:URL","Item Type Metadata:Event Type","Item Type Metadata:Participants","Item Type Metadata:Birth Date","Item Type Metadata:Birthplace","Item Type Metadata:Death Date","Item Type Metadata:Occupation","Item Type Metadata:Biographical Text","Item Type Metadata:Bibliography",tags,file,itemType,collection,public,featured
564,https://di.lib.vt.edu/items/show/564,,,,,"1953-07 (photo taken)",,,,,,,,,,,,,,"Leonard J. Currie Slides",,,,,,,,,"color slides",,"Bogotá, Distrito Capital de, Colombia",,,,,,,,,"Virginia Polytechnic Institute and State University. University Libraries^^Virginia Polytechnic Institute and State University. University Libraries. Special Collections Department (Repository)","Estate of Leonard J. Currie","La Sabana de Bogotá","Colombian^^aerial photographs^^landscapes (environments)^^farms^^Leonard J. Currie Slides^^South America^^Colombia","The savanna of Bogotá","Currie, Leonard J. (Leonard James), 1913-1996 (Photographer)",,,,,http://rightsstatements.org/vocab/InC-EDU/1.0/,"Virginia Tech Libraries Special Collections^^http://aspace.lib.vt.edu/repositories/2/resources/2315",,,Image,LJC_087_057,,,,,,,,,,,,,,,,,,,,,,,,,,,,,,,,,,,,"aerial photographs,Colombia,Currie - Leonard J,farms,landscapes (environments),Leonard J. Currie Slides,South America",https://di.lib.vt.edu/files/original/Leonard_J._Currie_s_Slides_Collection/LJC_087_057/LJC_087_057.jpg,,Colombia,1,0
565,https://di.lib.vt.edu/items/show/565,,,,,"1953-07 (photo taken)",,,,,,,,,,,,,,"Leonard J. Currie Slides",,,,,,,,,"color slides",,"Bogotá, Distrito Capital de, Colombia",,,,,,,,,"Virginia Polytechnic Institute and State University. University Libraries^^Virginia Polytechnic Institute and State University. University Libraries. Special Collections Department (Repository)","Estate of Leonard J. Currie","La Sabana de Bogotá","Colombian^^aerial photographs^^landscapes (environments)^^farms^^Leonard J. Currie Slides^^South America^^Colombia","The savanna of Bogotá","Currie, Leonard J. (Leonard James), 1913-1996 (Photographer)",,,,,http://rightsstatements.org/vocab/InC-EDU/1.0/,"Virginia Tech Libraries Special Collections^^http://aspace.lib.vt.edu/repositories/2/resources/2315",,,Image,LJC_087_058,,,,,,,,,,,,,,,,,,,,,,,,,,,,,,,,,,,,"aerial photographs,Colombia,Currie - Leonard J,farms,landscapes (environments),Leonard J. Currie Slides,South America",https://di.lib.vt.edu/files/original/Leonard_J._Currie_s_Slides_Collection/LJC_087_058/LJC_087_058.jpg,,Colombia,1,0
566,https://di.lib.vt.edu/items/show/566,,,,,"1953-07 (photo taken)",,,,,,,,,,,,,,"Leonard J. Currie Slides",,,,,,,,,"color slides",,"Bogotá, Distrito Capital de, Colombia",,,,,,,,,"Virginia Polytechnic Institute and State University. University Libraries^^Virginia Polytechnic Institute and State University. University Libraries. Special Collections Department (Repository)","Estate of Leonard J. Currie","La Sabana de Bogotá","Colombian^^aerial photographs^^landscapes (environments)^^farms^^Leonard J. Currie Slides^^South America^^Colombia","The savanna of Bogotá","Currie, Leonard J. (Leonard James), 1913-1996 (Photographer)",,,,,http://rightsstatements.org/vocab/InC-EDU/1.0/,"Virginia Tech Libraries Special Collections^^http://aspace.lib.vt.edu/repositories/2/resources/2315",,,Image,LJC_087_059,,,,,,,,,,,,,,,,,,,,,,,,,,,,,,,,,,,,"aerial photographs,Colombia,Currie - Leonard J,farms,landscapes (environments),Leonard J. Currie Slides,South America",https://di.lib.vt.edu/files/original/Leonard_J._Currie_s_Slides_Collection/LJC_087_059/LJC_087_059.jpg,,Colombia,1,0
567,https://di.lib.vt.edu/items/show/567,,,,,"1955-05 (photo taken)",,,,,,,,,,,,,,"Leonard J. Currie Slides",,,,,,,,,"color slides",,"Bogotá, Distrito Capital de, Colombia",,,,,,,,,"Virginia Polytechnic Institute and State University. University Libraries^^Virginia Polytechnic Institute and State University. University Libraries. Special Collections Department (Repository)","Estate of Leonard J. Currie","La Sabana de Bogotá","Colombian^^aerial photographs^^landscapes (environments)^^Leonard J. Currie Slides^^South America^^Colombia","The savanna of Bogotá","Currie, Leonard J. (Leonard James), 1913-1996 (Photographer)",,,,,http://rightsstatements.org/vocab/InC-EDU/1.0/,"Virginia Tech Libraries Special Collections^^http://aspace.lib.vt.edu/repositories/2/resources/2315",,,Image,LJC_087_060,,,,,,,,,,,,,,,,,,,,,,,,,,,,,,,,,,,,"aerial photographs,Colombia,Currie - Leonard J,landscapes (environments),Leonard J. Currie Slides,South America",https://di.lib.vt.edu/files/original/Leonard_J._Currie_s_Slides_Collection/LJC_087_060/LJC_087_060.jpg,,Colombia,1,0
568,https://di.lib.vt.edu/items/show/568,,,,,"1956-06 (photo taken)",,,,,,,,,,,,,,"Leonard J. Currie Slides",,,,,,,,,"color slides",,"Bogotá, Distrito Capital de, Colombia",,,,,,,,,"Virginia Polytechnic Institute and State University. University Libraries^^Virginia Polytechnic Institute and State University. University Libraries. Special Collections Department (Repository)","Estate of Leonard J. Currie","La Sabana de Bogotá","Colombian^^landscapes (environments)^^farms^^Leonard J. Currie Slides^^South America^^Colombia","The savanna of Bogotá","Currie, Leonard J. (Leonard James), 1913-1996 (Photographer)",,,,,http://rightsstatements.org/vocab/InC-EDU/1.0/,"Virginia Tech Libraries Special Collections^^http://aspace.lib.vt.edu/repositories/2/resources/2315",,,Image,LJC_087_061,,,,,,,,,,,,,,,,,,,,,,,,,,,,,,,,,,,,"Colombia,Currie - Leonard J,farms,landscapes (environments),Leonard J. Currie Slides,South America",https://di.lib.vt.edu/files/original/Leonard_J._Currie_s_Slides_Collection/LJC_087_061/LJC_087_061.jpg,,Colombia,1,0
569,https://di.lib.vt.edu/items/show/569,,,,,"1952-03 (photo taken)",,,,,,,,,,,,,,"Leonard J. Currie Slides",,,,,,,,,"color slides",,"Bogotá, Distrito Capital de, Colombia",,,,,,,,,"Virginia Polytechnic Institute and State University. University Libraries^^Virginia Polytechnic Institute and State University. University Libraries. Special Collections Department (Repository)","Estate of Leonard J. Currie","View from Mt. Serrate","Colombian^^landscapes (environments)^^urban areas^^Leonard J. Currie Slides^^South America^^Colombia",,"Currie, Leonard J. (Leonard James), 1913-1996 (Photographer)",,,,,http://rightsstatements.org/vocab/InC-EDU/1.0/,"Virginia Tech Libraries Special Collections^^http://aspace.lib.vt.edu/repositories/2/resources/2315",,,Image,LJC_087_062,,,,,,,,,,,,,,,,,,,,,,,,,,,,,,,,,,,,"Colombia,Currie - Leonard J,landscapes (environments),Leonard J. Currie Slides,South America,urban areas",https://di.lib.vt.edu/files/original/Leonard_J._Currie_s_Slides_Collection/LJC_087_062/LJC_087_062.jpg,,Colombia,1,0
570,https://di.lib.vt.edu/items/show/570,,,,,"1952-03 (photo taken)",,,,,,,,,,,,,,"Leonard J. Currie Slides",,,,,,,,,"color slides",,"Bogotá, Distrito Capital de, Colombia",,,,,,,,,"Virginia Polytechnic Institute and State University. University Libraries^^Virginia Polytechnic Institute and State University. University Libraries. Special Collections Department (Repository)","Estate of Leonard J. Currie","View from Mt. Serrate","Colombian^^landscapes (environments)^^urban areas^^Leonard J. Currie Slides^^South America^^Colombia",,"Currie, Leonard J. (Leonard James), 1913-1996 (Photographer)",,,,,http://rightsstatements.org/vocab/InC-EDU/1.0/,"Virginia Tech Libraries Special Collections^^http://aspace.lib.vt.edu/repositories/2/resources/2315",,,Image,LJC_087_063,,,,,,,,,,,,,,,,,,,,,,,,,,,,,,,,,,,,"Colombia,Currie - Leonard J,landscapes (environments),Leonard J. Currie Slides,South America,urban areas",https://di.lib.vt.edu/files/original/Leonard_J._Currie_s_Slides_Collection/LJC_087_063/LJC_087_063.jpg,,Colombia,1,0
571,https://di.lib.vt.edu/items/show/571,,,,,"1952-03 (photo taken)",,,,,,,,,,,,,,"Leonard J. Currie Slides",,,,,,,,,"color slides",,"Bogotá, Distrito Capital de, Colombia",,,,,,,,,"Virginia Polytechnic Institute and State University. University Libraries^^Virginia Polytechnic Institute and State University. University Libraries. Special Collections Department (Repository)","Estate of Leonard J. Currie","View from Mt. Serrate","Colombian^^landscapes (environments)^^Leonard J. Currie Slides^^South America^^Colombia",,"Currie, Leonard J. (Leonard James), 1913-1996 (Photographer)",,,,,http://rightsstatements.org/vocab/InC-EDU/1.0/,"Virginia Tech Libraries Special Collections^^http://aspace.lib.vt.edu/repositories/2/resources/2315",,,Image,LJC_087_064,,,,,,,,,,,,,,,,,,,,,,,,,,,,,,,,,,,,"Colombia,Currie - Leonard J,landscapes (environments),Leonard J. Currie Slides,South America",https://di.lib.vt.edu/files/original/Leonard_J._Currie_s_Slides_Collection/LJC_087_064/LJC_087_064.jpg,,Colombia,1,0
572,https://di.lib.vt.edu/items/show/572,,,,,"1952-03 (photo taken)",,,,,,,,,,,,,,"Leonard J. Currie Slides",,,,,,,,,"color slides",,"Bogotá, Distrito Capital de, Colombia",,,,,,,,,"Virginia Polytechnic Institute and State University. University Libraries^^Virginia Polytechnic Institute and State University. University Libraries. Special Collections Department (Repository)","Estate of Leonard J. Currie","View from Mt. Serrate","Colombian^^landscapes (environments)^^urban areas^^Leonard J. Currie Slides^^South America^^Colombia",,"Currie, Leonard J. (Leonard James), 1913-1996 (Photographer)",,,,,http://rightsstatements.org/vocab/InC-EDU/1.0/,"Virginia Tech Libraries Special Collections^^http://aspace.lib.vt.edu/repositories/2/resources/2315",,,Image,LJC_087_065,,,,,,,,,,,,,,,,,,,,,,,,,,,,,,,,,,,,"Colombia,Currie - Leonard J,landscapes (environments),Leonard J. Currie Slides,South America,urban areas",https://di.lib.vt.edu/files/original/Leonard_J._Currie_s_Slides_Collection/LJC_087_065/LJC_087_065.jpg,,Colombia,1,0
573,https://di.lib.vt.edu/items/show/573,,,,,"1952-04 (photo taken)",,,,,,,,,,,,,,"Leonard J. Currie Slides",,,,,,,,,"color slides",,"Bogotá, Distrito Capital de, Colombia",,,,,,,,,"Virginia Polytechnic Institute and State University. University Libraries^^Virginia Polytechnic Institute and State University. University Libraries. Special Collections Department (Repository)","Estate of Leonard J. Currie","View from Mt. Serrate","Colombian^^landscapes (environments)^^Leonard J. Currie Slides^^South America^^Colombia",,"Currie, Leonard J. (Leonard James), 1913-1996 (Photographer)",,,,,http://rightsstatements.org/vocab/InC-EDU/1.0/,"Virginia Tech Libraries Special Collections^^http://aspace.lib.vt.edu/repositories/2/resources/2315",,,Image,LJC_087_066,,,,,,,,,,,,,,,,,,,,,,,,,,,,,,,,,,,,"Colombia,Currie - Leonard J,landscapes (environments),Leonard J. Currie Slides,South America",https://di.lib.vt.edu/files/original/Leonard_J._Currie_s_Slides_Collection/LJC_087_066/LJC_087_066.jpg,,Colombia,1,0
574,https://di.lib.vt.edu/items/show/574,,,,,"1952-04 (photo taken)",,,,,,,,,,,,,,"Leonard J. Currie Slides",,,,,,,,,"color slides",,"Bogotá, Distrito Capital de, Colombia",,,,,,,,,"Virginia Polytechnic Institute and State University. University Libraries^^Virginia Polytechnic Institute and State University. University Libraries. Special Collections Department (Repository)","Estate of Leonard J. Currie","View from Mt. Serrate","Colombian^^landscapes (environments)^^Leonard J. Currie Slides^^South America^^Colombia",,"Currie, Leonard J. (Leonard James), 1913-1996 (Photographer)",,,,,http://rightsstatements.org/vocab/InC-EDU/1.0/,"Virginia Tech Libraries Special Collections^^http://aspace.lib.vt.edu/repositories/2/resources/2315",,,Image,LJC_087_067,,,,,,,,,,,,,,,,,,,,,,,,,,,,,,,,,,,,"Colombia,Currie - Leonard J,landscapes (environments),Leonard J. Currie Slides,South America",https://di.lib.vt.edu/files/original/Leonard_J._Currie_s_Slides_Collection/LJC_087_067/LJC_087_067.jpg,,Colombia,1,0
575,https://di.lib.vt.edu/items/show/575,,,,,"1951-11 (photo taken)",,,,,,,,,,,,,,"Leonard J. Currie Slides",,,,,,,,,"color slides",,"Bogotá, Distrito Capital de, Colombia",,,,,,,,,"Virginia Polytechnic Institute and State University. University Libraries^^Virginia Polytechnic Institute and State University. University Libraries. Special Collections Department (Repository)","Estate of Leonard J. Currie","View from Mt. Serrate","Colombian^^landscapes (environments)^^urban areas^^Leonard J. Currie Slides^^South America^^Colombia",,"Currie, Leonard J. (Leonard James), 1913-1996 (Photographer)",,,,,http://rightsstatements.org/vocab/InC-EDU/1.0/,"Virginia Tech Libraries Special Collections^^http://aspace.lib.vt.edu/repositories/2/resources/2315",,,Image,LJC_087_068,,,,,,,,,,,,,,,,,,,,,,,,,,,,,,,,,,,,"Colombia,Currie - Leonard J,landscapes (environments),Leonard J. Currie Slides,South America,urban areas",https://di.lib.vt.edu/files/original/Leonard_J._Currie_s_Slides_Collection/LJC_087_068/LJC_087_068.jpg,,Colombia,1,0
576,https://di.lib.vt.edu/items/show/576,,,,,"1951-11 (photo taken)",,,,,,,,,,,,,,"Leonard J. Currie Slides",,,,,,,,,"color slides",,"Bogotá, Distrito Capital de, Colombia",,,,,,,,,"Virginia Polytechnic Institute and State University. University Libraries^^Virginia Polytechnic Institute and State University. University Libraries. Special Collections Department (Repository)","Estate of Leonard J. Currie","View from Mt. Serrate","Colombian^^landscapes (environments)^^urban areas^^Leonard J. Currie Slides^^South America^^Colombia",,"Currie, Leonard J. (Leonard James), 1913-1996 (Photographer)",,,,,http://rightsstatements.org/vocab/InC-EDU/1.0/,"Virginia Tech Libraries Special Collections^^http://aspace.lib.vt.edu/repositories/2/resources/2315",,,Image,LJC_087_069,,,,,,,,,,,,,,,,,,,,,,,,,,,,,,,,,,,,"Colombia,Currie - Leonard J,landscapes (environments),Leonard J. Currie Slides,South America,urban areas",https://di.lib.vt.edu/files/original/Leonard_J._Currie_s_Slides_Collection/LJC_087_069/LJC_087_069.jpg,,Colombia,1,0
577,https://di.lib.vt.edu/items/show/577,,,,,"1951-11 (photo taken)",,,,,,,,,,,,,,"Leonard J. Currie Slides",,,,,,,,,"color slides",,"Bogotá, Distrito Capital de, Colombia",,,,,,,,,"Virginia Polytechnic Institute and State University. University Libraries^^Virginia Polytechnic Institute and State University. University Libraries. Special Collections Department (Repository)","Estate of Leonard J. Currie","View from Mt. Serrate","Colombian^^landscapes (environments)^^urban areas^^Leonard J. Currie Slides^^South America^^Colombia",,"Currie, Leonard J. (Leonard James), 1913-1996 (Photographer)",,,,,http://rightsstatements.org/vocab/InC-EDU/1.0/,"Virginia Tech Libraries Special Collections^^http://aspace.lib.vt.edu/repositories/2/resources/2315",,,Image,LJC_087_070,,,,,,,,,,,,,,,,,,,,,,,,,,,,,,,,,,,,"Colombia,Currie - Leonard J,landscapes (environments),Leonard J. Currie Slides,South America,urban areas",https://di.lib.vt.edu/files/original/Leonard_J._Currie_s_Slides_Collection/LJC_087_070/LJC_087_070.jpg,,Colombia,1,0
578,https://di.lib.vt.edu/items/show/578,,,,,"1951-11 (photo taken)",,,,,,,,,,,,,,"Leonard J. Currie Slides",,,,,,,,,"color slides",,"Bogotá, Distrito Capital de, Colombia",,,,,,,,,"Virginia Polytechnic Institute and State University. University Libraries^^Virginia Polytechnic Institute and State University. University Libraries. Special Collections Department (Repository)","Estate of Leonard J. Currie","View from Mt. Serrate","Colombian^^landscapes (environments)^^urban areas^^Leonard J. Currie Slides^^South America^^Colombia",,"Currie, Leonard J. (Leonard James), 1913-1996 (Photographer)",,,,,http://rightsstatements.org/vocab/InC-EDU/1.0/,"Virginia Tech Libraries Special Collections^^http://aspace.lib.vt.edu/repositories/2/resources/2315",,,Image,LJC_087_071,,,,,,,,,,,,,,,,,,,,,,,,,,,,,,,,,,,,"Colombia,Currie - Leonard J,landscapes (environments),Leonard J. Currie Slides,South America,urban areas",https://di.lib.vt.edu/files/original/Leonard_J._Currie_s_Slides_Collection/LJC_087_071/LJC_087_071.jpg,,Colombia,1,0
579,https://di.lib.vt.edu/items/show/579,,,,,"1951-11 (photo taken)",,,,,,,,,,,,,,"Leonard J. Currie Slides",,,,,,,,,"color slides",,"Bogotá, Distrito Capital de, Colombia",,,,,,,,,"Virginia Polytechnic Institute and State University. University Libraries^^Virginia Polytechnic Institute and State University. University Libraries. Special Collections Department (Repository)","Estate of Leonard J. Currie","View from Mt. Serrate","Colombian^^landscapes (environments)^^urban areas^^Leonard J. Currie Slides^^South America^^Colombia",,"Currie, Leonard J. (Leonard James), 1913-1996 (Photographer)",,,,,http://rightsstatements.org/vocab/InC-EDU/1.0/,"Virginia Tech Libraries Special Collections^^http://aspace.lib.vt.edu/repositories/2/resources/2315",,,Image,LJC_087_072,,,,,,,,,,,,,,,,,,,,,,,,,,,,,,,,,,,,"Colombia,Currie - Leonard J,landscapes (environments),Leonard J. Currie Slides,South America,urban areas",https://di.lib.vt.edu/files/original/Leonard_J._Currie_s_Slides_Collection/LJC_087_072/LJC_087_072.jpg,,Colombia,1,0
580,https://di.lib.vt.edu/items/show/580,,,,,"1951-11 (photo taken)",,,,,,,,,,,,,,"Leonard J. Currie Slides",,,,,,,,,"color slides",,"Bogotá, Distrito Capital de, Colombia",,,,,,,,,"Virginia Polytechnic Institute and State University. University Libraries^^Virginia Polytechnic Institute and State University. University Libraries. Special Collections Department (Repository)","Estate of Leonard J. Currie","View from Mt. Serrate","Colombian^^landscapes (environments)^^urban areas^^Leonard J. Currie Slides^^South America^^Colombia",,"Currie, Leonard J. (Leonard James), 1913-1996 (Photographer)",,,,,http://rightsstatements.org/vocab/InC-EDU/1.0/,"Virginia Tech Libraries Special Collections^^http://aspace.lib.vt.edu/repositories/2/resources/2315",,,Image,LJC_087_073,,,,,,,,,,,,,,,,,,,,,,,,,,,,,,,,,,,,"Colombia,Currie - Leonard J,landscapes (environments),Leonard J. Currie Slides,South America,urban areas",https://di.lib.vt.edu/files/original/Leonard_J._Currie_s_Slides_Collection/LJC_087_073/LJC_087_073.jpg,,Colombia,1,0
581,https://di.lib.vt.edu/items/show/581,,,,,"1954-01 (photo taken)",,,,,,,,,,,,,,"Leonard J. Currie Slides",,,,,,,,,"color slides",,"Cundinamarca, Colombia",,,,,,,,,"Virginia Polytechnic Institute and State University. University Libraries^^Virginia Polytechnic Institute and State University. University Libraries. Special Collections Department (Repository)","Estate of Leonard J. Currie","Laguna Guatavita","Colombian^^Heidrick, Lee^^landscapes (environments)^^portraits^^Leonard J. Currie Slides^^South America^^Colombia","Lee Heidrick","Currie, Leonard J. (Leonard James), 1913-1996 (Photographer)",,,,,http://rightsstatements.org/vocab/InC-EDU/1.0/,"Virginia Tech Libraries Special Collections^^http://aspace.lib.vt.edu/repositories/2/resources/2315",,,Image,LJC_087_074,,,,,,,,,,,,,,,,,,,,,,,,,,,,,,,,,,,,"Colombia,Currie - Leonard J,Heidrick - Lee,Heidrick, Lee,landscapes (environments),Leonard J. Currie Slides,portraits,South America",https://di.lib.vt.edu/files/original/Leonard_J._Currie_s_Slides_Collection/LJC_087_074/LJC_087_074.jpg,,Colombia,1,0
582,https://di.lib.vt.edu/items/show/582,,,,,"1977-12 (photo taken)",,,,,,,,,,,,,,"Leonard J. Currie Slides",,,,,,,,,"color slides",,"Bogotá, Distrito Capital de, Colombia",,,,,,,,,"Virginia Polytechnic Institute and State University. University Libraries^^Virginia Polytechnic Institute and State University. University Libraries. Special Collections Department (Repository)","Estate of Leonard J. Currie","View, Bogotá","Colombian^^landscapes (environments)^^urban areas^^Leonard J. Currie Slides^^South America^^Colombia",,"Currie, Leonard J. (Leonard James), 1913-1996 (Photographer)",,,,,http://rightsstatements.org/vocab/InC-EDU/1.0/,"Virginia Tech Libraries Special Collections^^http://aspace.lib.vt.edu/repositories/2/resources/2315",,,Image,LJC_087_075,,,,,,,,,,,,,,,,,,,,,,,,,,,,,,,,,,,,"Colombia,Currie - Leonard J,landscapes (environments),Leonard J. Currie Slides,South America,urban areas",https://di.lib.vt.edu/files/original/Leonard_J._Currie_s_Slides_Collection/LJC_087_075/LJC_087_075.jpg,,Colombia,1,0
600,https://di.lib.vt.edu/items/show/600,,,,,"1967-12 (slide developed)",,,,,,,,,,,,,,"Leonard J. Currie Slides",,,,,,,,,"color slides",,Colombia,,,,,,,,,"Virginia Polytechnic Institute and State University. University Libraries^^Virginia Polytechnic Institute and State University. University Libraries. Special Collections Department (Repository)","Estate of Leonard J. Currie",Colombia,"Colombian^^aerial photographs^^landscapes (environments)^^farms^^Leonard J. Currie Slides^^South America^^Colombia","The box of slides is labeled Colomba. Tenza and air views--Cauca Valley, Shabana de Bogota, etc.","Currie, Leonard J. (Leonard James), 1913-1996 (Photographer)",,,,,http://rightsstatements.org/vocab/InC-EDU/1.0/,"Virginia Tech Libraries Special Collections^^http://aspace.lib.vt.edu/repositories/2/resources/2315",,,Image,LJC_094_001,,,,,,,,,,,,,,,,,,,,,,,,,,,,,,,,,,,,"aerial photographs,Colombia,Currie - Leonard J,farms,landscapes (environments),Leonard J. Currie Slides,South America",https://di.lib.vt.edu/files/original/Leonard_J._Currie_s_Slides_Collection/LJC_094_001/LJC_094_001.jpg,,Colombia,1,0
