﻿"Item Id","Item URI","Dublin Core:Alternative Title","Dublin Core:Abstract","Dublin Core:Table Of Contents","Dublin Core:Date Available","Dublin Core:Date Created","Dublin Core:Date Accepted","Dublin Core:Date Copyrighted","Dublin Core:Date Submitted","Dublin Core:Date Issued","Dublin Core:Date Modified","Dublin Core:Date Valid","Dublin Core:Access Rights","Dublin Core:License","Dublin Core:Conforms To","Dublin Core:Has Format","Dublin Core:Has Part","Dublin Core:Has Version","Dublin Core:Is Format Of","Dublin Core:Is Part Of","Dublin Core:Is Referenced By","Dublin Core:Is Replaced By","Dublin Core:Is Required By","Dublin Core:Is Version Of","Dublin Core:References","Dublin Core:Replaces","Dublin Core:Requires","Dublin Core:Extent","Dublin Core:Medium","Dublin Core:Bibliographic Citation","Dublin Core:Spatial Coverage","Dublin Core:Temporal Coverage","Dublin Core:Accrual Method","Dublin Core:Accrual Periodicity","Dublin Core:Accrual Policy","Dublin Core:Audience","Dublin Core:Audience Education Level","Dublin Core:Mediator","Dublin Core:Instructional Method","Dublin Core:Provenance","Dublin Core:Rights Holder","Dublin Core:Title","Dublin Core:Subject","Dublin Core:Description","Dublin Core:Creator","Dublin Core:Source","Dublin Core:Publisher","Dublin Core:Date","Dublin Core:Contributor","Dublin Core:Rights","Dublin Core:Relation","Dublin Core:Format","Dublin Core:Language","Dublin Core:Type","Dublin Core:Identifier","Dublin Core:Coverage","Item Type Metadata:Text","Item Type Metadata:Interviewer","Item Type Metadata:Interviewee","Item Type Metadata:Location","Item Type Metadata:Transcription","Item Type Metadata:Local URL","Item Type Metadata:Original Format","Item Type Metadata:Physical Dimensions","Item Type Metadata:Duration","Item Type Metadata:Compression","Item Type Metadata:Producer","Item Type Metadata:Director","Item Type Metadata:Bit Rate/Frequency","Item Type Metadata:Time Summary","Item Type Metadata:Email Body","Item Type Metadata:Subject Line","Item Type Metadata:From","Item Type Metadata:To","Item Type Metadata:CC","Item Type Metadata:BCC","Item Type Metadata:Number of Attachments","Item Type Metadata:Standards","Item Type Metadata:Objectives","Item Type Metadata:Materials","Item Type Metadata:Lesson Plan Text","Item Type Metadata:URL","Item Type Metadata:Event Type","Item Type Metadata:Participants","Item Type Metadata:Birth Date","Item Type Metadata:Birthplace","Item Type Metadata:Death Date","Item Type Metadata:Occupation","Item Type Metadata:Biographical Text","Item Type Metadata:Bibliography",tags,file,itemType,collection,public,featured
3108,https://di.lib.vt.edu/items/show/3108,,,,,"1981-06 (photo taken)",,,,,,,,,,,,,,,,,,,,,,,"color slides",,"Blacksburg, Montgomery, Virginia, United States",,,,,,,,,"Virginia Polytechnic Institute and State University. University Libraries^^Virginia Polytechnic Institute and State University. University Libraries. Special Collections Department (Repository)","Estate of Leonard J. Currie","Adger S. Johnson House","American^^residential structures^^houses^^landscapes (environments)^^Leonard J. Currie Slides^^Currie Projects^^Johnson House","View from the house","Currie, Leonard J. (Leonard James), 1913-1996 (Photographer)",,,,"Currie, Leonard J. (Leonard James), 1913-1996 (Architect)",http://rightsstatements.org/vocab/InC-EDU/1.0/,"Virginia Tech Libraries Special Collections^^http://aspace.lib.vt.edu/repositories/2/resources/2315",,,Image,LJC_127_011,,,,,,,,,,,,,,,,,,,,,,,,,,,,,,,,,,,,"American,Currie - Leonard J,Currie Projects,houses,Johnson House,landscapes (environments),Leonard J. Currie Slides,residential structures",https://di.lib.vt.edu/files/original/Leonard_J._Currie_s_Slides_Collection/LJC_127_011/LJC_127_011.jpg,,"United States",1,0
1580,https://di.lib.vt.edu/items/show/1580,,,,,"1953-01 (photo taken)",,,,,,,,,,,,,,,,,,,,,,,"color slides",,Peru,,,,,,,,,"Virginia Polytechnic Institute and State University. University Libraries^^Virginia Polytechnic Institute and State University. University Libraries. Special Collections Department (Repository)","Estate of Leonard J. Currie","Andes, Peru","Peruvian^^aerial photographs^^landscapes (environments)^^Leonard J. Currie Slides^^South America^^Peru","Trip from Lima to Cusco^^Aerial view","Currie, Leonard J. (Leonard James), 1913-1996 (Photographer)",,,,,http://rightsstatements.org/vocab/InC-EDU/1.0/,"Virginia Tech Libraries Special Collections^^http://aspace.lib.vt.edu/repositories/2/resources/2315",,,Image,LJC_086_039,,,,,,,,,,,,,,,,,,,,,,,,,,,,,,,,,,,,"aerial photographs,Currie - Leonard J,landscapes (environments),Leonard J. Currie Slides,Peru,Peruvian,South America",https://di.lib.vt.edu/files/original/Leonard_J._Currie_s_Slides_Collection/LJC_086_039/LJC_086_039.jpg,,"South America",1,0
1902,https://di.lib.vt.edu/items/show/1902,,,,,"1973-04 (photo taken)",,,,,,,,,,,,,,,,,,,,,,,"color slides",,"Arcos de la Frontera, Cádiz, Andalusia, Spain",,,,,,,,,"Virginia Polytechnic Institute and State University. University Libraries^^Virginia Polytechnic Institute and State University. University Libraries. Special Collections Department (Repository)","Estate of Leonard J. Currie","Arcos de la Frontera, Spain","Spanish^^landscapes (environments)^^Leonard J. Currie Slides^^Europe^^Spain","The box of slides is identified as Spain - Jerez, Cadiz, Vejer de la Frontera, Arcos D.L.F.A., Ubrique, Ronda.","Currie, Leonard J. (Leonard James), 1913-1996 (Photographer)",,,,,http://rightsstatements.org/vocab/InC-EDU/1.0/,"Virginia Tech Libraries Special Collections^^http://aspace.lib.vt.edu/repositories/2/resources/2315",,,Image,LJC_103_015,,,,,,,,,,,,,,,,,,,,,,,,,,,,,,,,,,,,"Currie - Leonard J,Europe,landscapes (environments),Leonard J. Currie Slides,Spain,Spanish",https://di.lib.vt.edu/files/original/Leonard_J._Currie_s_Slides_Collection/LJC_103_015/LJC_103_015.jpg,,Spain,1,0
1656,https://di.lib.vt.edu/items/show/1656,,,,,"1973-07 (slide developed)",,,,,,,,,,,,,,,,,,,,,,,"color slides",,Belgium,,,,,,,,,"Virginia Polytechnic Institute and State University. University Libraries^^Virginia Polytechnic Institute and State University. University Libraries. Special Collections Department (Repository)","Estate of Leonard J. Currie",Belgium,"Belgian (region)^^landscapes (environments)^^windmills^^waterways^^rivers^^Leonard J. Currie Slides^^Europe^^Belgium",,"Currie, Leonard J. (Leonard James), 1913-1996 (Photographer)",,,,,http://rightsstatements.org/vocab/InC-EDU/1.0/,"Virginia Tech Libraries Special Collections^^http://aspace.lib.vt.edu/repositories/2/resources/2315",,,Image,LJC_137_053,,,,,,,,,,,,,,,,,,,,,,,,,,,,,,,,,,,,"Belgian (region),Belgium,Currie - Leonard J,Europe,landscapes (environments),Leonard J. Currie Slides,rivers,waterways,windmills",https://di.lib.vt.edu/files/original/Leonard_J._Currie_s_Slides_Collection/LJC_137_053/LJC_137_053.jpg,,Europe,1,0
1657,https://di.lib.vt.edu/items/show/1657,,,,,"1973-07 (slide developed)",,,,,,,,,,,,,,,,,,,,,,,"color slides",,Belgium,,,,,,,,,"Virginia Polytechnic Institute and State University. University Libraries^^Virginia Polytechnic Institute and State University. University Libraries. Special Collections Department (Repository)","Estate of Leonard J. Currie",Belgium,"Belgian (region)^^landscapes (environments)^^windmills^^waterways^^rivers^^Leonard J. Currie Slides^^Europe^^Belgium",,"Currie, Leonard J. (Leonard James), 1913-1996 (Photographer)",,,,,http://rightsstatements.org/vocab/InC-EDU/1.0/,"Virginia Tech Libraries Special Collections^^http://aspace.lib.vt.edu/repositories/2/resources/2315",,,Image,LJC_137_054,,,,,,,,,,,,,,,,,,,,,,,,,,,,,,,,,,,,"Belgian (region),Belgium,Currie - Leonard J,Europe,landscapes (environments),Leonard J. Currie Slides,rivers,waterways,windmills",https://di.lib.vt.edu/files/original/Leonard_J._Currie_s_Slides_Collection/LJC_137_054/LJC_137_054.jpg,,Europe,1,0
1865,https://di.lib.vt.edu/items/show/1865,,,,,"1973-04 (photo taken)",,,,,,,,,,,,,,,,,,,,,,,"color slides",,"Cádiz, Andalusia, Spain",,,,,,,,,"Virginia Polytechnic Institute and State University. University Libraries^^Virginia Polytechnic Institute and State University. University Libraries. Special Collections Department (Repository)","Estate of Leonard J. Currie","Cadiz province, Spain","Spanish^^landscapes (environments)^^Leonard J. Currie Slides^^Europe^^Spain","The box of slides is identified as Spain - Jerez, Cadiz, Vejer de la Frontera, Arcos D.L.F.A., Ubrique, Ronda.","Currie, Leonard J. (Leonard James), 1913-1996 (Photographer)",,,,,http://rightsstatements.org/vocab/InC-EDU/1.0/,"Virginia Tech Libraries Special Collections^^http://aspace.lib.vt.edu/repositories/2/resources/2315",,,Image,LJC_103_009,,,,,,,,,,,,,,,,,,,,,,,,,,,,,,,,,,,,"Currie - Leonard J,Europe,landscapes (environments),Leonard J. Currie Slides,Spain,Spanish",https://di.lib.vt.edu/files/original/Leonard_J._Currie_s_Slides_Collection/LJC_103_009/LJC_103_009.jpg,,Spain,1,0
1866,https://di.lib.vt.edu/items/show/1866,,,,,"1973-04 (photo taken)",,,,,,,,,,,,,,,,,,,,,,,"color slides",,"Cádiz, Andalusia, Spain",,,,,,,,,"Virginia Polytechnic Institute and State University. University Libraries^^Virginia Polytechnic Institute and State University. University Libraries. Special Collections Department (Repository)","Estate of Leonard J. Currie","Cadiz province, Spain","Spanish^^landscapes (environments)^^Leonard J. Currie Slides^^Europe^^Spain","The box of slides is identified as Spain - Jerez, Cadiz, Vejer de la Frontera, Arcos D.L.F.A., Ubrique, Ronda.","Currie, Leonard J. (Leonard James), 1913-1996 (Photographer)",,,,,http://rightsstatements.org/vocab/InC-EDU/1.0/,"Virginia Tech Libraries Special Collections^^http://aspace.lib.vt.edu/repositories/2/resources/2315",,,Image,LJC_103_010,,,,,,,,,,,,,,,,,,,,,,,,,,,,,,,,,,,,"Currie - Leonard J,Europe,landscapes (environments),Leonard J. Currie Slides,Spain,Spanish",https://di.lib.vt.edu/files/original/Leonard_J._Currie_s_Slides_Collection/LJC_103_010/LJC_103_010.jpg,,Spain,1,0
1867,https://di.lib.vt.edu/items/show/1867,,,,,"1973-04 (photo taken)",,,,,,,,,,,,,,,,,,,,,,,"color slides",,"Cádiz, Andalusia, Spain",,,,,,,,,"Virginia Polytechnic Institute and State University. University Libraries^^Virginia Polytechnic Institute and State University. University Libraries. Special Collections Department (Repository)","Estate of Leonard J. Currie","Cadiz province, Spain","Spanish^^landscapes (environments)^^waterways^^urban areas^^rivers^^Leonard J. Currie Slides^^Europe^^Spain","The box of slides is identified as Spain - Jerez, Cadiz, Vejer de la Frontera, Arcos D.L.F.A., Ubrique, Ronda.","Currie, Leonard J. (Leonard James), 1913-1996 (Photographer)",,,,,http://rightsstatements.org/vocab/InC-EDU/1.0/,"Virginia Tech Libraries Special Collections^^http://aspace.lib.vt.edu/repositories/2/resources/2315",,,Image,LJC_103_018,,,,,,,,,,,,,,,,,,,,,,,,,,,,,,,,,,,,"Currie - Leonard J,Europe,landscapes (environments),Leonard J. Currie Slides,rivers,Spain,Spanish,urban areas,waterways",https://di.lib.vt.edu/files/original/Leonard_J._Currie_s_Slides_Collection/LJC_103_018/LJC_103_018.jpg,,Spain,1,0
600,https://di.lib.vt.edu/items/show/600,,,,,"1967-12 (slide developed)",,,,,,,,,,,,,,"Leonard J. Currie Slides",,,,,,,,,"color slides",,Colombia,,,,,,,,,"Virginia Polytechnic Institute and State University. University Libraries^^Virginia Polytechnic Institute and State University. University Libraries. Special Collections Department (Repository)","Estate of Leonard J. Currie",Colombia,"Colombian^^aerial photographs^^landscapes (environments)^^farms^^Leonard J. Currie Slides^^South America^^Colombia","The box of slides is labeled Colomba. Tenza and air views--Cauca Valley, Shabana de Bogota, etc.","Currie, Leonard J. (Leonard James), 1913-1996 (Photographer)",,,,,http://rightsstatements.org/vocab/InC-EDU/1.0/,"Virginia Tech Libraries Special Collections^^http://aspace.lib.vt.edu/repositories/2/resources/2315",,,Image,LJC_094_001,,,,,,,,,,,,,,,,,,,,,,,,,,,,,,,,,,,,"aerial photographs,Colombia,Currie - Leonard J,farms,landscapes (environments),Leonard J. Currie Slides,South America",https://di.lib.vt.edu/files/original/Leonard_J._Currie_s_Slides_Collection/LJC_094_001/LJC_094_001.jpg,,Colombia,1,0
601,https://di.lib.vt.edu/items/show/601,,,,,"1967-12 (slide developed)",,,,,,,,,,,,,,"Leonard J. Currie Slides",,,,,,,,,"color slides",,Colombia,,,,,,,,,"Virginia Polytechnic Institute and State University. University Libraries^^Virginia Polytechnic Institute and State University. University Libraries. Special Collections Department (Repository)","Estate of Leonard J. Currie",Colombia,"Colombian^^aerial photographs^^landscapes (environments)^^Leonard J. Currie Slides^^South America^^Colombia","The box of slides is labeled Colomba. Tenza and air views--Cauca Valley, Shabana de Bogota, etc.","Currie, Leonard J. (Leonard James), 1913-1996 (Photographer)",,,,,http://rightsstatements.org/vocab/InC-EDU/1.0/,"Virginia Tech Libraries Special Collections^^http://aspace.lib.vt.edu/repositories/2/resources/2315",,,Image,LJC_094_002,,,,,,,,,,,,,,,,,,,,,,,,,,,,,,,,,,,,"aerial photographs,Colombia,Currie - Leonard J,landscapes (environments),Leonard J. Currie Slides,South America",https://di.lib.vt.edu/files/original/Leonard_J._Currie_s_Slides_Collection/LJC_094_002/LJC_094_002.jpg,,Colombia,1,0
602,https://di.lib.vt.edu/items/show/602,,,,,"1967-12 (slide developed)",,,,,,,,,,,,,,"Leonard J. Currie Slides",,,,,,,,,"color slides",,Colombia,,,,,,,,,"Virginia Polytechnic Institute and State University. University Libraries^^Virginia Polytechnic Institute and State University. University Libraries. Special Collections Department (Repository)","Estate of Leonard J. Currie",Colombia,"Colombian^^aerial photographs^^landscapes (environments)^^Leonard J. Currie Slides^^South America^^Colombia","The box of slides is labeled Colomba. Tenza and air views--Cauca Valley, Shabana de Bogota, etc.","Currie, Leonard J. (Leonard James), 1913-1996 (Photographer)",,,,,http://rightsstatements.org/vocab/InC-EDU/1.0/,"Virginia Tech Libraries Special Collections^^http://aspace.lib.vt.edu/repositories/2/resources/2315",,,Image,LJC_094_003,,,,,,,,,,,,,,,,,,,,,,,,,,,,,,,,,,,,"aerial photographs,Colombia,Currie - Leonard J,landscapes (environments),Leonard J. Currie Slides,South America",https://di.lib.vt.edu/files/original/Leonard_J._Currie_s_Slides_Collection/LJC_094_003/LJC_094_003.jpg,,Colombia,1,0
603,https://di.lib.vt.edu/items/show/603,,,,,"1967-12 (slide developed)",,,,,,,,,,,,,,"Leonard J. Currie Slides",,,,,,,,,"color slides",,Colombia,,,,,,,,,"Virginia Polytechnic Institute and State University. University Libraries^^Virginia Polytechnic Institute and State University. University Libraries. Special Collections Department (Repository)","Estate of Leonard J. Currie",Colombia,"Colombian^^aerial photographs^^landscapes (environments)^^Leonard J. Currie Slides^^South America^^Colombia","The box of slides is labeled Colomba. Tenza and air views--Cauca Valley, Shabana de Bogota, etc.","Currie, Leonard J. (Leonard James), 1913-1996 (Photographer)",,,,,http://rightsstatements.org/vocab/InC-EDU/1.0/,"Virginia Tech Libraries Special Collections^^http://aspace.lib.vt.edu/repositories/2/resources/2315",,,Image,LJC_094_004,,,,,,,,,,,,,,,,,,,,,,,,,,,,,,,,,,,,"aerial photographs,Colombia,Currie - Leonard J,landscapes (environments),Leonard J. Currie Slides,South America",https://di.lib.vt.edu/files/original/Leonard_J._Currie_s_Slides_Collection/LJC_094_004/LJC_094_004.jpg,,Colombia,1,0
604,https://di.lib.vt.edu/items/show/604,,,,,"1967-12 (slide developed)",,,,,,,,,,,,,,"Leonard J. Currie Slides",,,,,,,,,"color slides",,Colombia,,,,,,,,,"Virginia Polytechnic Institute and State University. University Libraries^^Virginia Polytechnic Institute and State University. University Libraries. Special Collections Department (Repository)","Estate of Leonard J. Currie",Colombia,"Colombian^^landscapes (environments)^^watercraft^^waterways^^rivers^^Leonard J. Currie Slides^^South America^^Colombia","The box of slides is labeled Colomba. Tenza and air views--Cauca Valley, Shabana de Bogota, etc.","Currie, Leonard J. (Leonard James), 1913-1996 (Photographer)",,,,,http://rightsstatements.org/vocab/InC-EDU/1.0/,"Virginia Tech Libraries Special Collections^^http://aspace.lib.vt.edu/repositories/2/resources/2315",,,Image,LJC_094_005,,,,,,,,,,,,,,,,,,,,,,,,,,,,,,,,,,,,"Colombia,Currie - Leonard J,landscapes (environments),Leonard J. Currie Slides,rivers,South America,watercraft,waterways",https://di.lib.vt.edu/files/original/Leonard_J._Currie_s_Slides_Collection/LJC_094_005/LJC_094_005.jpg,,Colombia,1,0
606,https://di.lib.vt.edu/items/show/606,,,,,"1967-12 (slide developed)",,,,,,,,,,,,,,"Leonard J. Currie Slides",,,,,,,,,"color slides",,Colombia,,,,,,,,,"Virginia Polytechnic Institute and State University. University Libraries^^Virginia Polytechnic Institute and State University. University Libraries. Special Collections Department (Repository)","Estate of Leonard J. Currie",Colombia,"Colombian^^aerial photographs^^landscapes (environments)^^Leonard J. Currie Slides^^South America^^Colombia","The box of slides is labeled Colomba. Tenza and air views--Cauca Valley, Shabana de Bogota, etc.","Currie, Leonard J. (Leonard James), 1913-1996 (Photographer)",,,,,http://rightsstatements.org/vocab/InC-EDU/1.0/,"Virginia Tech Libraries Special Collections^^http://aspace.lib.vt.edu/repositories/2/resources/2315",,,Image,LJC_094_007,,,,,,,,,,,,,,,,,,,,,,,,,,,,,,,,,,,,"aerial photographs,Colombia,Currie - Leonard J,landscapes (environments),Leonard J. Currie Slides,South America",https://di.lib.vt.edu/files/original/Leonard_J._Currie_s_Slides_Collection/LJC_094_007/LJC_094_007.jpg,,Colombia,1,0
613,https://di.lib.vt.edu/items/show/613,,,,,"1967-12 (slide developed)",,,,,,,,,,,,,,"Leonard J. Currie Slides",,,,,,,,,"color slides",,Colombia,,,,,,,,,"Virginia Polytechnic Institute and State University. University Libraries^^Virginia Polytechnic Institute and State University. University Libraries. Special Collections Department (Repository)","Estate of Leonard J. Currie",Colombia,"Colombian^^aerial photographs^^landscapes (environments)^^Leonard J. Currie Slides^^South America^^Colombia","The box of slides is labeled Colomba. Tenza and air views--Cauca Valley, Shabana de Bogota, etc.","Currie, Leonard J. (Leonard James), 1913-1996 (Photographer)",,,,,http://rightsstatements.org/vocab/InC-EDU/1.0/,"Virginia Tech Libraries Special Collections^^http://aspace.lib.vt.edu/repositories/2/resources/2315",,,Image,LJC_094_014,,,,,,,,,,,,,,,,,,,,,,,,,,,,,,,,,,,,"aerial photographs,Colombia,Currie - Leonard J,landscapes (environments),Leonard J. Currie Slides,South America",https://di.lib.vt.edu/files/original/Leonard_J._Currie_s_Slides_Collection/LJC_094_014/LJC_094_014.jpg,,Colombia,1,0
614,https://di.lib.vt.edu/items/show/614,,,,,"1967-12 (slide developed)",,,,,,,,,,,,,,"Leonard J. Currie Slides",,,,,,,,,"color slides",,Colombia,,,,,,,,,"Virginia Polytechnic Institute and State University. University Libraries^^Virginia Polytechnic Institute and State University. University Libraries. Special Collections Department (Repository)","Estate of Leonard J. Currie",Colombia,"Colombian^^aerial photographs^^landscapes (environments)^^Leonard J. Currie Slides^^South America^^Colombia","The box of slides is labeled Colomba. Tenza and air views--Cauca Valley, Shabana de Bogota, etc.","Currie, Leonard J. (Leonard James), 1913-1996 (Photographer)",,,,,http://rightsstatements.org/vocab/InC-EDU/1.0/,"Virginia Tech Libraries Special Collections^^http://aspace.lib.vt.edu/repositories/2/resources/2315",,,Image,LJC_094_015,,,,,,,,,,,,,,,,,,,,,,,,,,,,,,,,,,,,"aerial photographs,Colombia,Currie - Leonard J,landscapes (environments),Leonard J. Currie Slides,South America",https://di.lib.vt.edu/files/original/Leonard_J._Currie_s_Slides_Collection/LJC_094_015/LJC_094_015.jpg,,Colombia,1,0
615,https://di.lib.vt.edu/items/show/615,,,,,"1967-12 (slide developed)",,,,,,,,,,,,,,"Leonard J. Currie Slides",,,,,,,,,"color slides",,Colombia,,,,,,,,,"Virginia Polytechnic Institute and State University. University Libraries^^Virginia Polytechnic Institute and State University. University Libraries. Special Collections Department (Repository)","Estate of Leonard J. Currie",Colombia,"Colombian^^aerial photographs^^landscapes (environments)^^Leonard J. Currie Slides^^South America^^Colombia","The box of slides is labeled Colomba. Tenza and air views--Cauca Valley, Shabana de Bogota, etc.","Currie, Leonard J. (Leonard James), 1913-1996 (Photographer)",,,,,http://rightsstatements.org/vocab/InC-EDU/1.0/,"Virginia Tech Libraries Special Collections^^http://aspace.lib.vt.edu/repositories/2/resources/2315",,,Image,LJC_094_016,,,,,,,,,,,,,,,,,,,,,,,,,,,,,,,,,,,,"aerial photographs,Colombia,Currie - Leonard J,landscapes (environments),Leonard J. Currie Slides,South America",https://di.lib.vt.edu/files/original/Leonard_J._Currie_s_Slides_Collection/LJC_094_016/LJC_094_016.jpg,,Colombia,1,0
616,https://di.lib.vt.edu/items/show/616,,,,,"1967-12 (slide developed)",,,,,,,,,,,,,,"Leonard J. Currie Slides",,,,,,,,,"color slides",,Colombia,,,,,,,,,"Virginia Polytechnic Institute and State University. University Libraries^^Virginia Polytechnic Institute and State University. University Libraries. Special Collections Department (Repository)","Estate of Leonard J. Currie",Colombia,"Colombian^^aerial photographs^^landscapes (environments)^^Leonard J. Currie Slides^^South America^^Colombia","The box of slides is labeled Colomba. Tenza and air views--Cauca Valley, Shabana de Bogota, etc.","Currie, Leonard J. (Leonard James), 1913-1996 (Photographer)",,,,,http://rightsstatements.org/vocab/InC-EDU/1.0/,"Virginia Tech Libraries Special Collections^^http://aspace.lib.vt.edu/repositories/2/resources/2315",,,Image,LJC_094_017,,,,,,,,,,,,,,,,,,,,,,,,,,,,,,,,,,,,"aerial photographs,Colombia,Currie - Leonard J,landscapes (environments),Leonard J. Currie Slides,South America",https://di.lib.vt.edu/files/original/Leonard_J._Currie_s_Slides_Collection/LJC_094_017/LJC_094_017.jpg,,Colombia,1,0
617,https://di.lib.vt.edu/items/show/617,,,,,"1967-12 (slide developed)",,,,,,,,,,,,,,"Leonard J. Currie Slides",,,,,,,,,"color slides",,Colombia,,,,,,,,,"Virginia Polytechnic Institute and State University. University Libraries^^Virginia Polytechnic Institute and State University. University Libraries. Special Collections Department (Repository)","Estate of Leonard J. Currie",Colombia,"Colombian^^aerial photographs^^landscapes (environments)^^Leonard J. Currie Slides^^South America^^Colombia","The box of slides is labeled Colomba. Tenza and air views--Cauca Valley, Shabana de Bogota, etc.","Currie, Leonard J. (Leonard James), 1913-1996 (Photographer)",,,,,http://rightsstatements.org/vocab/InC-EDU/1.0/,"Virginia Tech Libraries Special Collections^^http://aspace.lib.vt.edu/repositories/2/resources/2315",,,Image,LJC_094_018,,,,,,,,,,,,,,,,,,,,,,,,,,,,,,,,,,,,"aerial photographs,Colombia,Currie - Leonard J,landscapes (environments),Leonard J. Currie Slides,South America",https://di.lib.vt.edu/files/original/Leonard_J._Currie_s_Slides_Collection/LJC_094_018/LJC_094_018.jpg,,Colombia,1,0