﻿"Item Id","Item URI","Dublin Core:Alternative Title","Dublin Core:Abstract","Dublin Core:Table Of Contents","Dublin Core:Date Available","Dublin Core:Date Created","Dublin Core:Date Accepted","Dublin Core:Date Copyrighted","Dublin Core:Date Submitted","Dublin Core:Date Issued","Dublin Core:Date Modified","Dublin Core:Date Valid","Dublin Core:Access Rights","Dublin Core:License","Dublin Core:Conforms To","Dublin Core:Has Format","Dublin Core:Has Part","Dublin Core:Has Version","Dublin Core:Is Format Of","Dublin Core:Is Part Of","Dublin Core:Is Referenced By","Dublin Core:Is Replaced By","Dublin Core:Is Required By","Dublin Core:Is Version Of","Dublin Core:References","Dublin Core:Replaces","Dublin Core:Requires","Dublin Core:Extent","Dublin Core:Medium","Dublin Core:Bibliographic Citation","Dublin Core:Spatial Coverage","Dublin Core:Temporal Coverage","Dublin Core:Accrual Method","Dublin Core:Accrual Periodicity","Dublin Core:Accrual Policy","Dublin Core:Audience","Dublin Core:Audience Education Level","Dublin Core:Mediator","Dublin Core:Instructional Method","Dublin Core:Provenance","Dublin Core:Rights Holder","Dublin Core:Title","Dublin Core:Subject","Dublin Core:Description","Dublin Core:Creator","Dublin Core:Source","Dublin Core:Publisher","Dublin Core:Date","Dublin Core:Contributor","Dublin Core:Rights","Dublin Core:Relation","Dublin Core:Format","Dublin Core:Language","Dublin Core:Type","Dublin Core:Identifier","Dublin Core:Coverage","Item Type Metadata:Text","Item Type Metadata:Interviewer","Item Type Metadata:Interviewee","Item Type Metadata:Location","Item Type Metadata:Transcription","Item Type Metadata:Local URL","Item Type Metadata:Original Format","Item Type Metadata:Physical Dimensions","Item Type Metadata:Duration","Item Type Metadata:Compression","Item Type Metadata:Producer","Item Type Metadata:Director","Item Type Metadata:Bit Rate/Frequency","Item Type Metadata:Time Summary","Item Type Metadata:Email Body","Item Type Metadata:Subject Line","Item Type Metadata:From","Item Type Metadata:To","Item Type Metadata:CC","Item Type Metadata:BCC","Item Type Metadata:Number of Attachments","Item Type Metadata:Standards","Item Type Metadata:Objectives","Item Type Metadata:Materials","Item Type Metadata:Lesson Plan Text","Item Type Metadata:URL","Item Type Metadata:Event Type","Item Type Metadata:Participants","Item Type Metadata:Birth Date","Item Type Metadata:Birthplace","Item Type Metadata:Death Date","Item Type Metadata:Occupation","Item Type Metadata:Biographical Text","Item Type Metadata:Bibliography",tags,file,itemType,collection,public,featured
1890,https://di.lib.vt.edu/items/show/1890,,,,,"1973-05 (photo taken)",,,,,,,,,,,,,,,,,,,,,,,"color slides",,"Granada, Andalusia, Spain",,,,,,,,,"Virginia Polytechnic Institute and State University. University Libraries^^Virginia Polytechnic Institute and State University. University Libraries. Special Collections Department (Repository)","Estate of Leonard J. Currie","Alhambra, Granada, Spain","Spanish^^palaces^^palace complexes^^landscape gardening^^Spanish and North African Islamic styles and periods^^Leonard J. Currie Slides^^Europe^^Spain",,"Currie, Leonard J. (Leonard James), 1913-1996 (Photographer)",,,,,http://rightsstatements.org/vocab/InC-EDU/1.0/,"Virginia Tech Libraries Special Collections^^http://aspace.lib.vt.edu/repositories/2/resources/2315",,,Image,LJC_104_021,,,,,,,,,,,,,,,,,,,,,,,,,,,,,,,,,,,,"Currie - Leonard J,Europe,landscape gardening,Leonard J. Currie Slides,palace complexes,palaces,Spain,Spanish,Spanish and North African Islamic styles and periods",https://di.lib.vt.edu/files/original/Leonard_J._Currie_s_Slides_Collection/LJC_104_021/LJC_104_021.jpg,,Spain,1,0
1891,https://di.lib.vt.edu/items/show/1891,,,,,"1973-05 (photo taken)",,,,,,,,,,,,,,,,,,,,,,,"color slides",,"Granada, Andalusia, Spain",,,,,,,,,"Virginia Polytechnic Institute and State University. University Libraries^^Virginia Polytechnic Institute and State University. University Libraries. Special Collections Department (Repository)","Estate of Leonard J. Currie","Alhambra, Granada, Spain","Spanish^^palaces^^palace complexes^^courtyards^^Leonard J. Currie Slides^^Europe^^Spain","Palace of Charles V","Currie, Leonard J. (Leonard James), 1913-1996 (Photographer)",,,,,http://rightsstatements.org/vocab/InC-EDU/1.0/,"Virginia Tech Libraries Special Collections^^http://aspace.lib.vt.edu/repositories/2/resources/2315",,,Image,LJC_104_022,,,,,,,,,,,,,,,,,,,,,,,,,,,,,,,,,,,,"courtyards,Currie - Leonard J,Europe,Leonard J. Currie Slides,palace complexes,palaces,Spain,Spanish",https://di.lib.vt.edu/files/original/Leonard_J._Currie_s_Slides_Collection/LJC_104_022/LJC_104_022.jpg,,Spain,1,0
1892,https://di.lib.vt.edu/items/show/1892,,,,,"1973-05 (photo taken)",,,,,,,,,,,,,,,,,,,,,,,"color slides",,"Granada, Andalusia, Spain",,,,,,,,,"Virginia Polytechnic Institute and State University. University Libraries^^Virginia Polytechnic Institute and State University. University Libraries. Special Collections Department (Repository)","Estate of Leonard J. Currie","Alhambra, Granada, Spain","Spanish^^palaces^^palace complexes^^courtyards^^Leonard J. Currie Slides^^Europe^^Spain","Palace of Charles V","Currie, Leonard J. (Leonard James), 1913-1996 (Photographer)",,,,,http://rightsstatements.org/vocab/InC-EDU/1.0/,"Virginia Tech Libraries Special Collections^^http://aspace.lib.vt.edu/repositories/2/resources/2315",,,Image,LJC_104_023,,,,,,,,,,,,,,,,,,,,,,,,,,,,,,,,,,,,"courtyards,Currie - Leonard J,Europe,Leonard J. Currie Slides,palace complexes,palaces,Spain,Spanish",https://di.lib.vt.edu/files/original/Leonard_J._Currie_s_Slides_Collection/LJC_104_023/LJC_104_023.jpg,,Spain,1,0
1893,https://di.lib.vt.edu/items/show/1893,,,,,"1973-05 (photo taken)",,,,,,,,,,,,,,,,,,,,,,,"color slides",,"Granada, Andalusia, Spain",,,,,,,,,"Virginia Polytechnic Institute and State University. University Libraries^^Virginia Polytechnic Institute and State University. University Libraries. Special Collections Department (Repository)","Estate of Leonard J. Currie","Alhambra, Granada, Spain","Spanish^^palaces^^palace complexes^^courtyards^^Leonard J. Currie Slides^^Europe^^Spain","Palace of Charles V","Currie, Leonard J. (Leonard James), 1913-1996 (Photographer)",,,,,http://rightsstatements.org/vocab/InC-EDU/1.0/,"Virginia Tech Libraries Special Collections^^http://aspace.lib.vt.edu/repositories/2/resources/2315",,,Image,LJC_104_024,,,,,,,,,,,,,,,,,,,,,,,,,,,,,,,,,,,,"courtyards,Currie - Leonard J,Europe,Leonard J. Currie Slides,palace complexes,palaces,Spain,Spanish",https://di.lib.vt.edu/files/original/Leonard_J._Currie_s_Slides_Collection/LJC_104_024/LJC_104_024.jpg,,Spain,1,0
1894,https://di.lib.vt.edu/items/show/1894,,,,,"1973-05 (photo taken)",,,,,,,,,,,,,,,,,,,,,,,"color slides",,"Granada, Andalusia, Spain",,,,,,,,,"Virginia Polytechnic Institute and State University. University Libraries^^Virginia Polytechnic Institute and State University. University Libraries. Special Collections Department (Repository)","Estate of Leonard J. Currie","Alhambra, Granada, Spain","Spanish^^palaces^^palace complexes^^fountains^^landscape gardening^^Spanish and North African Islamic styles and periods^^Leonard J. Currie Slides^^Europe^^Spain",,"Currie, Leonard J. (Leonard James), 1913-1996 (Photographer)",,,,,http://rightsstatements.org/vocab/InC-EDU/1.0/,"Virginia Tech Libraries Special Collections^^http://aspace.lib.vt.edu/repositories/2/resources/2315",,,Image,LJC_104_025,,,,,,,,,,,,,,,,,,,,,,,,,,,,,,,,,,,,"Currie - Leonard J,Europe,fountains,landscape gardening,Leonard J. Currie Slides,palace complexes,palaces,Spain,Spanish,Spanish and North African Islamic styles and periods",https://di.lib.vt.edu/files/original/Leonard_J._Currie_s_Slides_Collection/LJC_104_025/LJC_104_025.jpg,,Spain,1,0
1895,https://di.lib.vt.edu/items/show/1895,,,,,"1973-05 (photo taken)",,,,,,,,,,,,,,,,,,,,,,,"color slides",,"Granada, Andalusia, Spain",,,,,,,,,"Virginia Polytechnic Institute and State University. University Libraries^^Virginia Polytechnic Institute and State University. University Libraries. Special Collections Department (Repository)","Estate of Leonard J. Currie","Alhambra, Granada, Spain","Spanish^^palaces^^palace complexes^^landscape gardening^^Spanish and North African Islamic styles and periods^^Leonard J. Currie Slides^^Europe^^Spain",,"Currie, Leonard J. (Leonard James), 1913-1996 (Photographer)",,,,,http://rightsstatements.org/vocab/InC-EDU/1.0/,"Virginia Tech Libraries Special Collections^^http://aspace.lib.vt.edu/repositories/2/resources/2315",,,Image,LJC_104_026,,,,,,,,,,,,,,,,,,,,,,,,,,,,,,,,,,,,"Currie - Leonard J,Europe,landscape gardening,Leonard J. Currie Slides,palace complexes,palaces,Spain,Spanish,Spanish and North African Islamic styles and periods",https://di.lib.vt.edu/files/original/Leonard_J._Currie_s_Slides_Collection/LJC_104_026/LJC_104_026.jpg,,Spain,1,0
1896,https://di.lib.vt.edu/items/show/1896,,,,,"1973-05 (photo taken)",,,,,,,,,,,,,,,,,,,,,,,"color slides",,"Granada, Andalusia, Spain",,,,,,,,,"Virginia Polytechnic Institute and State University. University Libraries^^Virginia Polytechnic Institute and State University. University Libraries. Special Collections Department (Repository)","Estate of Leonard J. Currie","Alhambra, Granada, Spain","Spanish^^palaces^^palace complexes^^Spanish and North African Islamic styles and periods^^Leonard J. Currie Slides^^Europe^^Spain",,"Currie, Leonard J. (Leonard James), 1913-1996 (Photographer)",,,,,http://rightsstatements.org/vocab/InC-EDU/1.0/,"Virginia Tech Libraries Special Collections^^http://aspace.lib.vt.edu/repositories/2/resources/2315",,,Image,LJC_104_027,,,,,,,,,,,,,,,,,,,,,,,,,,,,,,,,,,,,"Currie - Leonard J,Europe,Leonard J. Currie Slides,palace complexes,palaces,Spain,Spanish,Spanish and North African Islamic styles and periods",https://di.lib.vt.edu/files/original/Leonard_J._Currie_s_Slides_Collection/LJC_104_027/LJC_104_027.jpg,,Spain,1,0
1897,https://di.lib.vt.edu/items/show/1897,,,,,"1973-05 (photo taken)",,,,,,,,,,,,,,,,,,,,,,,"color slides",,"Granada, Andalusia, Spain",,,,,,,,,"Virginia Polytechnic Institute and State University. University Libraries^^Virginia Polytechnic Institute and State University. University Libraries. Special Collections Department (Repository)","Estate of Leonard J. Currie","Alhambra, Granada, Spain","Spanish^^palaces^^palace complexes^^courtyards^^landscape gardening^^fountains^^Spanish and North African Islamic styles and periods^^Leonard J. Currie Slides^^Europe^^Spain",,"Currie, Leonard J. (Leonard James), 1913-1996 (Photographer)",,,,,http://rightsstatements.org/vocab/InC-EDU/1.0/,"Virginia Tech Libraries Special Collections^^http://aspace.lib.vt.edu/repositories/2/resources/2315",,,Image,LJC_104_028,,,,,,,,,,,,,,,,,,,,,,,,,,,,,,,,,,,,"courtyards,Currie - Leonard J,Europe,fountains,landscape gardening,Leonard J. Currie Slides,palace complexes,palaces,Spain,Spanish,Spanish and North African Islamic styles and periods",https://di.lib.vt.edu/files/original/Leonard_J._Currie_s_Slides_Collection/LJC_104_028/LJC_104_028.jpg,,Spain,1,0
1898,https://di.lib.vt.edu/items/show/1898,,,,,"1973-05 (photo taken)",,,,,,,,,,,,,,,,,,,,,,,"color slides",,"Granada, Andalusia, Spain",,,,,,,,,"Virginia Polytechnic Institute and State University. University Libraries^^Virginia Polytechnic Institute and State University. University Libraries. Special Collections Department (Repository)","Estate of Leonard J. Currie","Alhambra, Granada, Spain","Spanish^^palaces^^palace complexes^^fountains^^landscape gardening^^Spanish and North African Islamic styles and periods^^Leonard J. Currie Slides^^Europe^^Spain",,"Currie, Leonard J. (Leonard James), 1913-1996 (Photographer)",,,,,http://rightsstatements.org/vocab/InC-EDU/1.0/,"Virginia Tech Libraries Special Collections^^http://aspace.lib.vt.edu/repositories/2/resources/2315",,,Image,LJC_104_029,,,,,,,,,,,,,,,,,,,,,,,,,,,,,,,,,,,,"Currie - Leonard J,Europe,fountains,landscape gardening,Leonard J. Currie Slides,palace complexes,palaces,Spain,Spanish,Spanish and North African Islamic styles and periods",https://di.lib.vt.edu/files/original/Leonard_J._Currie_s_Slides_Collection/LJC_104_029/LJC_104_029.jpg,,Spain,1,0
209,https://di.lib.vt.edu/items/show/209,,,,,"1972-09 (photo taken)",,,,,,,,,,,,,,"Leonard J. Currie Slides",,,,,,,,,"color slides",,"Kyoto, Kyōto, Kinki, Japan",,,,,,,,,"Virginia Polytechnic Institute and State University. University Libraries^^Virginia Polytechnic Institute and State University. University Libraries. Special Collections Department (Repository)","Estate of Leonard J. Currie","Imperial Palace, Kyoto","Japanese^^entrances^^exterior views^^palaces^^palace complexes^^Asia^^Japan",,"Currie, Leonard J. (Leonard James), 1913-1996  (Photographer)",,,,,http://rightsstatements.org/vocab/InC-EDU/1.0/,"Virginia Tech Libraries Special Collections^^http://aspace.lib.vt.edu/repositories/2/resources/2315",image/jpeg,,Image,LJC_142_030,,,,,,,,,,,,,,,,,,,,,,,,,,,,,,,,,,,,"Asia,Currie - Leonard J,entrances,exterior views,Japan,Japanese,Leonard J. Currie Slides,palace complexes,palaces",https://di.lib.vt.edu/files/original/Leonard_J._Currie_s_Slides_Collection/LJC_142_030/LJC_142_030.jpg,,Japan,1,0
210,https://di.lib.vt.edu/items/show/210,,,,,"1972-09 (photo taken)",,,,,,,,,,,,,,"Leonard J. Currie Slides",,,,,,,,,"color slides",,"Kyoto, Kyōto, Kinki, Japan",,,,,,,,,"Virginia Polytechnic Institute and State University. University Libraries^^Virginia Polytechnic Institute and State University. University Libraries. Special Collections Department (Repository)","Estate of Leonard J. Currie","Imperial Palace, Kyoto","Japanese^^entrances^^exterior views^^palaces^^palace complexes^^Asia^^Japan",,"Currie, Leonard J. (Leonard James), 1913-1996  (Photographer)",,,,,http://rightsstatements.org/vocab/InC-EDU/1.0/,"Virginia Tech Libraries Special Collections^^http://aspace.lib.vt.edu/repositories/2/resources/2315",image/jpeg,,Image,LJC_142_031,,,,,,,,,,,,,,,,,,,,,,,,,,,,,,,,,,,,"Asia,Currie - Leonard J,entrances,exterior views,Japan,Japanese,Leonard J. Currie Slides,palace complexes,palaces",https://di.lib.vt.edu/files/original/Leonard_J._Currie_s_Slides_Collection/LJC_142_031/LJC_142_031.jpg,,Japan,1,0
211,https://di.lib.vt.edu/items/show/211,,,,,"1972-09 (photo taken)",,,,,,,,,,,,,,"Leonard J. Currie Slides",,,,,,,,,"color slides",,"Kyoto, Kyōto, Kinki, Japan",,,,,,,,,"Virginia Polytechnic Institute and State University. University Libraries^^Virginia Polytechnic Institute and State University. University Libraries. Special Collections Department (Repository)","Estate of Leonard J. Currie","Imperial Palace, Kyoto","Japanese^^palaces^^exterior views^^palace complexes^^Asia^^Japan",,"Currie, Leonard J. (Leonard James), 1913-1996  (Photographer)",,,,,http://rightsstatements.org/vocab/InC-EDU/1.0/,"Virginia Tech Libraries Special Collections^^http://aspace.lib.vt.edu/repositories/2/resources/2315",image/jpeg,,Image,LJC_142_032,,,,,,,,,,,,,,,,,,,,,,,,,,,,,,,,,,,,"Asia,Currie - Leonard J,exterior views,Japan,Japanese,Leonard J. Currie Slides,palace complexes,palaces",https://di.lib.vt.edu/files/original/Leonard_J._Currie_s_Slides_Collection/LJC_142_032/LJC_142_032.jpg,,Japan,1,0
212,https://di.lib.vt.edu/items/show/212,,,,,"1972-09 (photo taken)",,,,,,,,,,,,,,"Leonard J. Currie Slides",,,,,,,,,"color slides",,"Kyoto, Kyōto, Kinki, Japan",,,,,,,,,"Virginia Polytechnic Institute and State University. University Libraries^^Virginia Polytechnic Institute and State University. University Libraries. Special Collections Department (Repository)","Estate of Leonard J. Currie","Imperial Palace, Kyoto","Japanese^^exterior views^^palaces^^palace complexes^^Asia^^Japan",,"Currie, Leonard J. (Leonard James), 1913-1996  (Photographer)",,,,,http://rightsstatements.org/vocab/InC-EDU/1.0/,"Virginia Tech Libraries Special Collections^^http://aspace.lib.vt.edu/repositories/2/resources/2315",image/jpeg,,Image,LJC_142_033,,,,,,,,,,,,,,,,,,,,,,,,,,,,,,,,,,,,"Asia,Currie - Leonard J,exterior views,Japan,Japanese,Leonard J. Currie Slides,palace complexes,palaces",https://di.lib.vt.edu/files/original/Leonard_J._Currie_s_Slides_Collection/LJC_142_033/LJC_142_033.jpg,,Japan,1,0
213,https://di.lib.vt.edu/items/show/213,,,,,"1972-09 (photo taken)",,,,,,,,,,,,,,"Leonard J. Currie Slides",,,,,,,,,"color slides",,"Kyoto, Kyōto, Kinki, Japan",,,,,,,,,"Virginia Polytechnic Institute and State University. University Libraries^^Virginia Polytechnic Institute and State University. University Libraries. Special Collections Department (Repository)","Estate of Leonard J. Currie","Imperial Palace, Kyoto","Japanese^^entrances^^exterior views^^palaces^^palace complexes^^Asia^^Japan",,"Currie, Leonard J. (Leonard James), 1913-1996  (Photographer)",,,,,http://rightsstatements.org/vocab/InC-EDU/1.0/,"Virginia Tech Libraries Special Collections^^http://aspace.lib.vt.edu/repositories/2/resources/2315",image/jpeg,,Image,LJC_142_034,,,,,,,,,,,,,,,,,,,,,,,,,,,,,,,,,,,,"Asia,Currie - Leonard J,entrances,exterior views,Japan,Japanese,Leonard J. Currie Slides,palace complexes,palaces",https://di.lib.vt.edu/files/original/Leonard_J._Currie_s_Slides_Collection/LJC_142_034/LJC_142_034.jpg,,Japan,1,0
1075,https://di.lib.vt.edu/items/show/1075,,,,,"1972-09 (photo taken)",,,,,,,,,,,,,,"Leonard J. Currie Slides",,,,,,,,,"color slides",,"Kyoto, Kyōto, Kinki, Japan",,,,,,,,,"Virginia Polytechnic Institute and State University. University Libraries^^Virginia Polytechnic Institute and State University. University Libraries. Special Collections Department (Repository)","Estate of Leonard J. Currie","Imperial Palace, Kyoto","Japanese^^palaces^^exterior views^^palace complexes^^Leonard J. Currie Slides^^Asia^^Japan",,"Currie, Leonard J. (Leonard James), 1913-1996 (Photographer)",,,,,http://rightsstatements.org/vocab/InC-EDU/1.0/,"Virginia Tech Libraries Special Collections^^http://aspace.lib.vt.edu/repositories/2/resources/2315",,,Image,LJC_135_027,,,,,,,,,,,,,,,,,,,,,,,,,,,,,,,,,,,,"Asia,Currie - Leonard J,exterior views,Japan,Japanese,Leonard J. Currie Slides,palace complexes,palaces",https://di.lib.vt.edu/files/original/Leonard_J._Currie_s_Slides_Collection/LJC_135_027/LJC_135_027.jpg,,Japan,1,0
1076,https://di.lib.vt.edu/items/show/1076,,,,,"1972-09 (photo taken)",,,,,,,,,,,,,,"Leonard J. Currie Slides",,,,,,,,,"color slides",,"Kyoto, Kyōto, Kinki, Japan",,,,,,,,,"Virginia Polytechnic Institute and State University. University Libraries^^Virginia Polytechnic Institute and State University. University Libraries. Special Collections Department (Repository)","Estate of Leonard J. Currie","Imperial Palace, Kyoto","Japanese^^palaces^^exterior views^^palace complexes^^Leonard J. Currie Slides^^Asia^^Japan",,"Currie, Leonard J. (Leonard James), 1913-1996 (Photographer)",,,,,http://rightsstatements.org/vocab/InC-EDU/1.0/,"Virginia Tech Libraries Special Collections^^http://aspace.lib.vt.edu/repositories/2/resources/2315",,,Image,LJC_135_028,,,,,,,,,,,,,,,,,,,,,,,,,,,,,,,,,,,,"Asia,Currie - Leonard J,exterior views,Japan,Japanese,Leonard J. Currie Slides,palace complexes,palaces",https://di.lib.vt.edu/files/original/Leonard_J._Currie_s_Slides_Collection/LJC_135_028/LJC_135_028.jpg,,Japan,1,0
1077,https://di.lib.vt.edu/items/show/1077,,,,,"1972-09 (photo taken)",,,,,,,,,,,,,,"Leonard J. Currie Slides",,,,,,,,,"color slides",,"Kyoto, Kyōto, Kinki, Japan",,,,,,,,,"Virginia Polytechnic Institute and State University. University Libraries^^Virginia Polytechnic Institute and State University. University Libraries. Special Collections Department (Repository)","Estate of Leonard J. Currie","Imperial Palace, Kyoto","Japanese^^palaces^^exterior views^^palace complexes^^Leonard J. Currie Slides^^Asia^^Japan",,"Currie, Leonard J. (Leonard James), 1913-1996 (Photographer)",,,,,http://rightsstatements.org/vocab/InC-EDU/1.0/,"Virginia Tech Libraries Special Collections^^http://aspace.lib.vt.edu/repositories/2/resources/2315",,,Image,LJC_135_029,,,,,,,,,,,,,,,,,,,,,,,,,,,,,,,,,,,,"Asia,Currie - Leonard J,exterior views,Japan,Japanese,Leonard J. Currie Slides,palace complexes,palaces",https://di.lib.vt.edu/files/original/Leonard_J._Currie_s_Slides_Collection/LJC_135_029/LJC_135_029.jpg,,Japan,1,0
1078,https://di.lib.vt.edu/items/show/1078,,,,,"1972-09 (photo taken)",,,,,,,,,,,,,,"Leonard J. Currie Slides",,,,,,,,,"color slides",,"Kyoto, Kyōto, Kinki, Japan",,,,,,,,,"Virginia Polytechnic Institute and State University. University Libraries^^Virginia Polytechnic Institute and State University. University Libraries. Special Collections Department (Repository)","Estate of Leonard J. Currie","Imperial Palace, Kyoto","Japanese^^palaces^^exterior views^^palace complexes^^Leonard J. Currie Slides^^Asia^^Japan",,"Currie, Leonard J. (Leonard James), 1913-1996 (Photographer)",,,,,http://rightsstatements.org/vocab/InC-EDU/1.0/,"Virginia Tech Libraries Special Collections^^http://aspace.lib.vt.edu/repositories/2/resources/2315",,,Image,LJC_135_030,,,,,,,,,,,,,,,,,,,,,,,,,,,,,,,,,,,,"Asia,Currie - Leonard J,exterior views,Japan,Japanese,Leonard J. Currie Slides,palace complexes,palaces",https://di.lib.vt.edu/files/original/Leonard_J._Currie_s_Slides_Collection/LJC_135_030/LJC_135_030.jpg,,Japan,1,0
1079,https://di.lib.vt.edu/items/show/1079,,,,,"1972-09 (photo taken)",,,,,,,,,,,,,,"Leonard J. Currie Slides",,,,,,,,,"color slides",,"Kyoto, Kyōto, Kinki, Japan",,,,,,,,,"Virginia Polytechnic Institute and State University. University Libraries^^Virginia Polytechnic Institute and State University. University Libraries. Special Collections Department (Repository)","Estate of Leonard J. Currie","Imperial Palace, Kyoto","Japanese^^palaces^^exterior views^^palace complexes^^Leonard J. Currie Slides^^Asia^^Japan",,"Currie, Leonard J. (Leonard James), 1913-1996 (Photographer)",,,,,http://rightsstatements.org/vocab/InC-EDU/1.0/,"Virginia Tech Libraries Special Collections^^http://aspace.lib.vt.edu/repositories/2/resources/2315",,,Image,LJC_135_031,,,,,,,,,,,,,,,,,,,,,,,,,,,,,,,,,,,,"Asia,Currie - Leonard J,exterior views,Japan,Japanese,Leonard J. Currie Slides,palace complexes,palaces",https://di.lib.vt.edu/files/original/Leonard_J._Currie_s_Slides_Collection/LJC_135_031/LJC_135_031.jpg,,Japan,1,0
1080,https://di.lib.vt.edu/items/show/1080,,,,,"1972-09 (photo taken)",,,,,,,,,,,,,,"Leonard J. Currie Slides",,,,,,,,,"color slides",,"Kyoto, Kyōto, Kinki, Japan",,,,,,,,,"Virginia Polytechnic Institute and State University. University Libraries^^Virginia Polytechnic Institute and State University. University Libraries. Special Collections Department (Repository)","Estate of Leonard J. Currie","Imperial Palace, Kyoto","Japanese^^palace complexes^^palaces^^landscape gardening^^Leonard J. Currie Slides^^Asia^^Japan",,"Currie, Leonard J. (Leonard James), 1913-1996 (Photographer)",,,,,http://rightsstatements.org/vocab/InC-EDU/1.0/,"Virginia Tech Libraries Special Collections^^http://aspace.lib.vt.edu/repositories/2/resources/2315",,,Image,LJC_135_032,,,,,,,,,,,,,,,,,,,,,,,,,,,,,,,,,,,,"Asia,Currie - Leonard J,Japan,Japanese,landscape gardening,Leonard J. Currie Slides,palace complexes,palaces",https://di.lib.vt.edu/files/original/Leonard_J._Currie_s_Slides_Collection/LJC_135_032/LJC_135_032.jpg,,Japan,1,0
