﻿"Item Id","Item URI","Dublin Core:Alternative Title","Dublin Core:Abstract","Dublin Core:Table Of Contents","Dublin Core:Date Available","Dublin Core:Date Created","Dublin Core:Date Accepted","Dublin Core:Date Copyrighted","Dublin Core:Date Submitted","Dublin Core:Date Issued","Dublin Core:Date Modified","Dublin Core:Date Valid","Dublin Core:Access Rights","Dublin Core:License","Dublin Core:Conforms To","Dublin Core:Has Format","Dublin Core:Has Part","Dublin Core:Has Version","Dublin Core:Is Format Of","Dublin Core:Is Part Of","Dublin Core:Is Referenced By","Dublin Core:Is Replaced By","Dublin Core:Is Required By","Dublin Core:Is Version Of","Dublin Core:References","Dublin Core:Replaces","Dublin Core:Requires","Dublin Core:Extent","Dublin Core:Medium","Dublin Core:Bibliographic Citation","Dublin Core:Spatial Coverage","Dublin Core:Temporal Coverage","Dublin Core:Accrual Method","Dublin Core:Accrual Periodicity","Dublin Core:Accrual Policy","Dublin Core:Audience","Dublin Core:Audience Education Level","Dublin Core:Mediator","Dublin Core:Instructional Method","Dublin Core:Provenance","Dublin Core:Rights Holder","Dublin Core:Title","Dublin Core:Subject","Dublin Core:Description","Dublin Core:Creator","Dublin Core:Source","Dublin Core:Publisher","Dublin Core:Date","Dublin Core:Contributor","Dublin Core:Rights","Dublin Core:Relation","Dublin Core:Format","Dublin Core:Language","Dublin Core:Type","Dublin Core:Identifier","Dublin Core:Coverage","Item Type Metadata:Text","Item Type Metadata:Interviewer","Item Type Metadata:Interviewee","Item Type Metadata:Location","Item Type Metadata:Transcription","Item Type Metadata:Local URL","Item Type Metadata:Original Format","Item Type Metadata:Physical Dimensions","Item Type Metadata:Duration","Item Type Metadata:Compression","Item Type Metadata:Producer","Item Type Metadata:Director","Item Type Metadata:Bit Rate/Frequency","Item Type Metadata:Time Summary","Item Type Metadata:Email Body","Item Type Metadata:Subject Line","Item Type Metadata:From","Item Type Metadata:To","Item Type Metadata:CC","Item Type Metadata:BCC","Item Type Metadata:Number of Attachments","Item Type Metadata:Standards","Item Type Metadata:Objectives","Item Type Metadata:Materials","Item Type Metadata:Lesson Plan Text","Item Type Metadata:URL","Item Type Metadata:Event Type","Item Type Metadata:Participants","Item Type Metadata:Birth Date","Item Type Metadata:Birthplace","Item Type Metadata:Death Date","Item Type Metadata:Occupation","Item Type Metadata:Biographical Text","Item Type Metadata:Bibliography",tags,file,itemType,collection,public,featured
1650,https://di.lib.vt.edu/items/show/1650,,,,,"1976-07 (photo taken)",,,,,,,,,,,,,,,,,,,,,,,"color slides",,"Holy See",,,,,,,,,"Virginia Polytechnic Institute and State University. University Libraries^^Virginia Polytechnic Institute and State University. University Libraries. Special Collections Department (Repository)","Estate of Leonard J. Currie","St. Peter's","Italian^^religious complexes^^religious buildings^^exterior views^^landscape gardening^^towers (building divisions)^^Leonard J. Currie Slides^^Europe^^Italy",,"Currie, Leonard J. (Leonard James), 1913-1996 (Photographer)",,,,,http://rightsstatements.org/vocab/InC-EDU/1.0/,"Virginia Tech Libraries Special Collections^^http://aspace.lib.vt.edu/repositories/2/resources/2315",,,Image,LJC_106_014,,,,,,,,,,,,,,,,,,,,,,,,,,,,,,,,,,,,"Currie - Leonard J,Europe,exterior views,Italian,Italy,landscape gardening,Leonard J. Currie Slides,religious buildings,religious complexes,towers (building divisions)",https://di.lib.vt.edu/files/original/Leonard_J._Currie_s_Slides_Collection/LJC_106_014/LJC_106_014.jpg,,Italy,1,0
1649,https://di.lib.vt.edu/items/show/1649,,,,,"1976-07 (photo taken)",,,,,,,,,,,,,,,,,,,,,,,"color slides",,"Holy See",,,,,,,,,"Virginia Polytechnic Institute and State University. University Libraries^^Virginia Polytechnic Institute and State University. University Libraries. Special Collections Department (Repository)","Estate of Leonard J. Currie","St. Peter's","Italian^^religious complexes^^religious buildings^^interior views^^works of art^^Leonard J. Currie Slides^^Europe^^Italy",,"Currie, Leonard J. (Leonard James), 1913-1996 (Photographer)",,,,,http://rightsstatements.org/vocab/InC-EDU/1.0/,"Virginia Tech Libraries Special Collections^^http://aspace.lib.vt.edu/repositories/2/resources/2315",,,Image,LJC_106_013,,,,,,,,,,,,,,,,,,,,,,,,,,,,,,,,,,,,"Currie - Leonard J,Europe,interior views,Italian,Italy,Leonard J. Currie Slides,religious buildings,religious complexes,works of art",https://di.lib.vt.edu/files/original/Leonard_J._Currie_s_Slides_Collection/LJC_106_013/LJC_106_013.jpg,,Italy,1,0
1648,https://di.lib.vt.edu/items/show/1648,,,,,"1976-07 (photo taken)",,,,,,,,,,,,,,,,,,,,,,,"color slides",,"Holy See",,,,,,,,,"Virginia Polytechnic Institute and State University. University Libraries^^Virginia Polytechnic Institute and State University. University Libraries. Special Collections Department (Repository)","Estate of Leonard J. Currie","St. Peter's","Italian^^religious complexes^^religious buildings^^interior views^^works of art^^Leonard J. Currie Slides^^Europe^^Italy",,"Currie, Leonard J. (Leonard James), 1913-1996 (Photographer)",,,,,http://rightsstatements.org/vocab/InC-EDU/1.0/,"Virginia Tech Libraries Special Collections^^http://aspace.lib.vt.edu/repositories/2/resources/2315",,,Image,LJC_106_012,,,,,,,,,,,,,,,,,,,,,,,,,,,,,,,,,,,,"Currie - Leonard J,Europe,interior views,Italian,Italy,Leonard J. Currie Slides,religious buildings,religious complexes,works of art",https://di.lib.vt.edu/files/original/Leonard_J._Currie_s_Slides_Collection/LJC_106_012/LJC_106_012.jpg,,Italy,1,0
1647,https://di.lib.vt.edu/items/show/1647,,,,,"1976-07 (photo taken)",,,,,,,,,,,,,,,,,,,,,,,"color slides",,"Holy See",,,,,,,,,"Virginia Polytechnic Institute and State University. University Libraries^^Virginia Polytechnic Institute and State University. University Libraries. Special Collections Department (Repository)","Estate of Leonard J. Currie","St. Peter's","Italian^^religious complexes^^religious buildings^^landscape gardening^^towers (building divisions)^^Leonard J. Currie Slides^^Europe^^Italy",,"Currie, Leonard J. (Leonard James), 1913-1996 (Photographer)",,,,,http://rightsstatements.org/vocab/InC-EDU/1.0/,"Virginia Tech Libraries Special Collections^^http://aspace.lib.vt.edu/repositories/2/resources/2315",,,Image,LJC_106_011,,,,,,,,,,,,,,,,,,,,,,,,,,,,,,,,,,,,"Currie - Leonard J,Europe,Italian,Italy,landscape gardening,Leonard J. Currie Slides,religious buildings,religious complexes,towers (building divisions)",https://di.lib.vt.edu/files/original/Leonard_J._Currie_s_Slides_Collection/LJC_106_011/LJC_106_011.jpg,,Italy,1,0
1646,https://di.lib.vt.edu/items/show/1646,,,,,"1976-07 (photo taken)",,,,,,,,,,,,,,,,,,,,,,,"color slides",,"Holy See",,,,,,,,,"Virginia Polytechnic Institute and State University. University Libraries^^Virginia Polytechnic Institute and State University. University Libraries. Special Collections Department (Repository)","Estate of Leonard J. Currie","St. Peter's","Italian^^religious complexes^^religious buildings^^exterior views^^open spaces^^towers (single built works)^^Leonard J. Currie Slides^^Europe^^Italy",,"Currie, Leonard J. (Leonard James), 1913-1996 (Photographer)",,,,,http://rightsstatements.org/vocab/InC-EDU/1.0/,"Virginia Tech Libraries Special Collections^^http://aspace.lib.vt.edu/repositories/2/resources/2315",,,Image,LJC_106_010,,,,,,,,,,,,,,,,,,,,,,,,,,,,,,,,,,,,"Currie - Leonard J,Europe,exterior views,Italian,Italy,Leonard J. Currie Slides,open spaces,religious buildings,religious complexes,towers (single built works)",https://di.lib.vt.edu/files/original/Leonard_J._Currie_s_Slides_Collection/LJC_106_010/LJC_106_010.jpg,,Italy,1,0
1645,https://di.lib.vt.edu/items/show/1645,,,,,"1976-07 (photo taken)",,,,,,,,,,,,,,,,,,,,,,,"color slides",,"Holy See",,,,,,,,,"Virginia Polytechnic Institute and State University. University Libraries^^Virginia Polytechnic Institute and State University. University Libraries. Special Collections Department (Repository)","Estate of Leonard J. Currie","St. Peter's","Italian^^religious complexes^^religious buildings^^interior views^^works of art^^Leonard J. Currie Slides^^Europe^^Italy",,"Currie, Leonard J. (Leonard James), 1913-1996 (Photographer)",,,,,http://rightsstatements.org/vocab/InC-EDU/1.0/,"Virginia Tech Libraries Special Collections^^http://aspace.lib.vt.edu/repositories/2/resources/2315",,,Image,LJC_106_009,,,,,,,,,,,,,,,,,,,,,,,,,,,,,,,,,,,,"Currie - Leonard J,Europe,interior views,Italian,Italy,Leonard J. Currie Slides,religious buildings,religious complexes,works of art",https://di.lib.vt.edu/files/original/Leonard_J._Currie_s_Slides_Collection/LJC_106_009/LJC_106_009.jpg,,Italy,1,0
1644,https://di.lib.vt.edu/items/show/1644,,,,,"1976-07 (photo taken)",,,,,,,,,,,,,,,,,,,,,,,"color slides",,"Holy See",,,,,,,,,"Virginia Polytechnic Institute and State University. University Libraries^^Virginia Polytechnic Institute and State University. University Libraries. Special Collections Department (Repository)","Estate of Leonard J. Currie","St. Peter's","Italian^^religious complexes^^religious buildings^^interior views^^works of art^^Leonard J. Currie Slides^^Europe^^Italy",,"Currie, Leonard J. (Leonard James), 1913-1996 (Photographer)",,,,,http://rightsstatements.org/vocab/InC-EDU/1.0/,"Virginia Tech Libraries Special Collections^^http://aspace.lib.vt.edu/repositories/2/resources/2315",,,Image,LJC_106_007,,,,,,,,,,,,,,,,,,,,,,,,,,,,,,,,,,,,"Currie - Leonard J,Europe,interior views,Italian,Italy,Leonard J. Currie Slides,religious buildings,religious complexes,works of art",https://di.lib.vt.edu/files/original/Leonard_J._Currie_s_Slides_Collection/LJC_106_007/LJC_106_007.jpg,,Italy,1,0
1643,https://di.lib.vt.edu/items/show/1643,,,,,"1976-07 (photo taken)",,,,,,,,,,,,,,,,,,,,,,,"color slides",,"Holy See",,,,,,,,,"Virginia Polytechnic Institute and State University. University Libraries^^Virginia Polytechnic Institute and State University. University Libraries. Special Collections Department (Repository)","Estate of Leonard J. Currie","St. Peter's","Italian^^religious complexes^^religious buildings^^open spaces^^exterior views^^Leonard J. Currie Slides^^Europe^^Italy",,"Currie, Leonard J. (Leonard James), 1913-1996 (Photographer)",,,,,http://rightsstatements.org/vocab/InC-EDU/1.0/,"Virginia Tech Libraries Special Collections^^http://aspace.lib.vt.edu/repositories/2/resources/2315",,,Image,LJC_106_006,,,,,,,,,,,,,,,,,,,,,,,,,,,,,,,,,,,,"Currie - Leonard J,Europe,exterior views,Italian,Italy,Leonard J. Currie Slides,open spaces,religious buildings,religious complexes",https://di.lib.vt.edu/files/original/Leonard_J._Currie_s_Slides_Collection/LJC_106_006/LJC_106_006.jpg,,Italy,1,0
169,https://di.lib.vt.edu/items/show/169,,,,,"1972-09 (photo taken)",,,,,,,,,,,,,,"Leonard J. Currie Slides",,,,,,,,,"color slides",,"Kyoto, Kyōto, Kinki, Japan",,,,,,,,,"Virginia Polytechnic Institute and State University. University Libraries^^Virginia Polytechnic Institute and State University. University Libraries. Special Collections Department (Repository)","Estate of Leonard J. Currie","Ryoan-ji Temple, Kyoto","Japanese^^religious complexes^^landscape gardening^^Asia^^Japan",,"Currie, Leonard J. (Leonard James), 1913-1996  (Photographer)",,,,,http://rightsstatements.org/vocab/InC-EDU/1.0/,"Virginia Tech Libraries Special Collections^^http://aspace.lib.vt.edu/repositories/2/resources/2315",image/jpeg,,Image,LJC_141_025,,,,,,,,,,,,,,,,,,,,,,,,,,,,,,,,,,,,"Asia,Currie - Leonard J,Japan,Japanese,landscape gardening,Leonard J. Currie Slides,religious complexes",https://di.lib.vt.edu/files/original/Leonard_J._Currie_s_Slides_Collection/LJC_141_025/LJC_141_025.jpg,,Japan,1,0
168,https://di.lib.vt.edu/items/show/168,,,,,"1972-09 (photo taken)",,,,,,,,,,,,,,"Leonard J. Currie Slides",,,,,,,,,"color slides",,"Kyoto, Kyōto, Kinki, Japan",,,,,,,,,"Virginia Polytechnic Institute and State University. University Libraries^^Virginia Polytechnic Institute and State University. University Libraries. Special Collections Department (Repository)","Estate of Leonard J. Currie","Ryoan-ji Temple, Kyoto","Japanese^^religious complexes^^exterior views^^religious buildings^^Asia^^Japan",,"Currie, Leonard J. (Leonard James), 1913-1996  (Photographer)",,,,,http://rightsstatements.org/vocab/InC-EDU/1.0/,"Virginia Tech Libraries Special Collections^^http://aspace.lib.vt.edu/repositories/2/resources/2315",image/jpeg,,Image,LJC_141_024,,,,,,,,,,,,,,,,,,,,,,,,,,,,,,,,,,,,"Asia,Currie - Leonard J,exterior views,Japan,Japanese,Leonard J. Currie Slides,religious buildings,religious complexes",https://di.lib.vt.edu/files/original/Leonard_J._Currie_s_Slides_Collection/LJC_141_024/LJC_141_024.jpg,,Japan,1,0
167,https://di.lib.vt.edu/items/show/167,,,,,"1972-09 (photo taken)",,,,,,,,,,,,,,"Leonard J. Currie Slides",,,,,,,,,"color slides",,"Kyoto, Kyōto, Kinki, Japan",,,,,,,,,"Virginia Polytechnic Institute and State University. University Libraries^^Virginia Polytechnic Institute and State University. University Libraries. Special Collections Department (Repository)","Estate of Leonard J. Currie","Ryoan-ji Temple, Kyoto","Japanese^^religious complexes^^interior views^^religious buildings^^Asia^^Japan",,"Currie, Leonard J. (Leonard James), 1913-1996  (Photographer)",,,,,http://rightsstatements.org/vocab/InC-EDU/1.0/,"Virginia Tech Libraries Special Collections^^http://aspace.lib.vt.edu/repositories/2/resources/2315",image/jpeg,,Image,LJC_141_023,,,,,,,,,,,,,,,,,,,,,,,,,,,,,,,,,,,,"Asia,Currie - Leonard J,interior views,Japan,Japanese,Leonard J. Currie Slides,religious buildings,religious complexes",https://di.lib.vt.edu/files/original/Leonard_J._Currie_s_Slides_Collection/LJC_141_023/LJC_141_023.jpg,,Japan,1,0
166,https://di.lib.vt.edu/items/show/166,,,,,"1972-09 (photo taken)",,,,,,,,,,,,,,"Leonard J. Currie Slides",,,,,,,,,"color slides",,"Kyoto, Kyōto, Kinki, Japan",,,,,,,,,"Virginia Polytechnic Institute and State University. University Libraries^^Virginia Polytechnic Institute and State University. University Libraries. Special Collections Department (Repository)","Estate of Leonard J. Currie","Ryoan-ji Temple, Kyoto","Japanese^^religious complexes^^landscape gardening^^religious buildings^^exterior views^^Asia^^Japan",,"Currie, Leonard J. (Leonard James), 1913-1996  (Photographer)",,,,,http://rightsstatements.org/vocab/InC-EDU/1.0/,"Virginia Tech Libraries Special Collections^^http://aspace.lib.vt.edu/repositories/2/resources/2315",image/jpeg,,Image,LJC_141_022,,,,,,,,,,,,,,,,,,,,,,,,,,,,,,,,,,,,"Asia,Currie - Leonard J,exterior views,Japan,Japanese,landscape gardening,Leonard J. Currie Slides,religious buildings,religious complexes",https://di.lib.vt.edu/files/original/Leonard_J._Currie_s_Slides_Collection/LJC_141_022/LJC_141_022.jpg,,Japan,1,0
165,https://di.lib.vt.edu/items/show/165,,,,,"1972-09 (photo taken)",,,,,,,,,,,,,,"Leonard J. Currie Slides",,,,,,,,,"color slides",,"Kyoto, Kyōto, Kinki, Japan",,,,,,,,,"Virginia Polytechnic Institute and State University. University Libraries^^Virginia Polytechnic Institute and State University. University Libraries. Special Collections Department (Repository)","Estate of Leonard J. Currie","Ryoan-ji Temple, Kyoto","Japanese^^religious complexes^^exterior views^^religious buildings^^landscape gardening^^Asia^^Japan",,"Currie, Leonard J. (Leonard James), 1913-1996  (Photographer)",,,,,http://rightsstatements.org/vocab/InC-EDU/1.0/,"Virginia Tech Libraries Special Collections^^http://aspace.lib.vt.edu/repositories/2/resources/2315",image/jpeg,,Image,LJC_141_021,,,,,,,,,,,,,,,,,,,,,,,,,,,,,,,,,,,,"Asia,Currie - Leonard J,exterior views,Japan,Japanese,landscape gardening,Leonard J. Currie Slides,religious buildings,religious complexes",https://di.lib.vt.edu/files/original/Leonard_J._Currie_s_Slides_Collection/LJC_141_021/LJC_141_021.jpg,,Japan,1,0
164,https://di.lib.vt.edu/items/show/164,,,,,"1972-09 (photo taken)",,,,,,,,,,,,,,"Leonard J. Currie Slides",,,,,,,,,"color slides",,"Kyoto, Kyōto, Kinki, Japan",,,,,,,,,"Virginia Polytechnic Institute and State University. University Libraries^^Virginia Polytechnic Institute and State University. University Libraries. Special Collections Department (Repository)","Estate of Leonard J. Currie","Ryoan-ji Temple, Kyoto","Japanese^^religious complexes^^landscape gardening^^exterior views^^religious buildings^^Asia^^Japan",,"Currie, Leonard J. (Leonard James), 1913-1996  (Photographer)",,,,,http://rightsstatements.org/vocab/InC-EDU/1.0/,"Virginia Tech Libraries Special Collections^^http://aspace.lib.vt.edu/repositories/2/resources/2315",image/jpeg,,Image,LJC_141_020,,,,,,,,,,,,,,,,,,,,,,,,,,,,,,,,,,,,"Asia,Currie - Leonard J,exterior views,Japan,Japanese,landscape gardening,Leonard J. Currie Slides,religious buildings,religious complexes",https://di.lib.vt.edu/files/original/Leonard_J._Currie_s_Slides_Collection/LJC_141_020/LJC_141_020.jpg,,Japan,1,0
163,https://di.lib.vt.edu/items/show/163,,,,,"1972-09 (photo taken)",,,,,,,,,,,,,,"Leonard J. Currie Slides",,,,,,,,,"color slides",,"Kyoto, Kyōto, Kinki, Japan",,,,,,,,,"Virginia Polytechnic Institute and State University. University Libraries^^Virginia Polytechnic Institute and State University. University Libraries. Special Collections Department (Repository)","Estate of Leonard J. Currie","Ryoan-ji Temple, Kyoto","Japanese^^religious complexes^^landscape gardening^^exterior views^^religious buildings^^Asia^^Japan",,"Currie, Leonard J. (Leonard James), 1913-1996  (Photographer)",,,,,http://rightsstatements.org/vocab/InC-EDU/1.0/,"Virginia Tech Libraries Special Collections^^http://aspace.lib.vt.edu/repositories/2/resources/2315",image/jpeg,,Image,LJC_141_019,,,,,,,,,,,,,,,,,,,,,,,,,,,,,,,,,,,,"Asia,Currie - Leonard J,exterior views,Japan,Japanese,landscape gardening,Leonard J. Currie Slides,religious buildings,religious complexes",https://di.lib.vt.edu/files/original/Leonard_J._Currie_s_Slides_Collection/LJC_141_019/LJC_141_019.jpg,,Japan,1,0
162,https://di.lib.vt.edu/items/show/162,,,,,"1972-09 (photo taken)",,,,,,,,,,,,,,"Leonard J. Currie Slides",,,,,,,,,"color slides",,,,,,,,,,,"Virginia Polytechnic Institute and State University. University Libraries^^Virginia Polytechnic Institute and State University. University Libraries. Special Collections Department (Repository)","Estate of Leonard J. Currie","Ryōan-ji Temple, Kyoto","Japanese^^religious complexes^^religious buildings^^exterior views^^landscape gardening^^Asia^^Japan",,"Currie, Leonard J. (Leonard James), 1913-1996  (Photographer)",,,,,http://rightsstatements.org/vocab/InC-EDU/1.0/,"Virginia Tech Libraries Special Collections^^http://aspace.lib.vt.edu/repositories/2/resources/2315",image/jpeg,,Image,LJC_141_018,,,,,,,,,,,,,,,,,,,,,,,,,,,,,,,,,,,,"Asia,Currie - Leonard J,exterior views,Japan,Japanese,landscape gardening,Leonard J. Currie Slides,religious buildings,religious complexes",https://di.lib.vt.edu/files/original/Leonard_J._Currie_s_Slides_Collection/LJC_141_018/LJC_141_018.jpg,,Japan,1,0
658,https://di.lib.vt.edu/items/show/658,,,,,"1956-07 (photo taken)",,,,,,,,,,,,,,"Leonard J. Currie Slides",,,,,,,,,"color slides",,"Cartagena, Bolívar, Colombia",,,,,,,,,"Virginia Polytechnic Institute and State University. University Libraries^^Virginia Polytechnic Institute and State University. University Libraries. Special Collections Department (Repository)","Estate of Leonard J. Currie","Ruins of Convento de la Popa, Cartagena, Colombia","Colombian^^courtyards^^religious complexes^^ruins^^Leonard J. Currie Slides^^South America^^Colombia",,"Currie, Leonard J. (Leonard James), 1913-1996 (Photographer)",,,,,http://rightsstatements.org/vocab/InC-EDU/1.0/,"Virginia Tech Libraries Special Collections^^http://aspace.lib.vt.edu/repositories/2/resources/2315",,,Image,LJC_101_021,,,,,,,,,,,,,,,,,,,,,,,,,,,,,,,,,,,,"Colombia,courtyards,Currie - Leonard J,Leonard J. Currie Slides,religious complexes,ruins,South America",https://di.lib.vt.edu/files/original/Leonard_J._Currie_s_Slides_Collection/LJC_101_021/LJC_101_021.jpg,,Colombia,1,0
2109,https://di.lib.vt.edu/items/show/2109,,,,,"1965-07 (photo taken)",,,,,,,,,,,,,,,,,,,,,,,"color slides",,"Tikal, Petén, Guatemala",,,,,,,,,"Virginia Polytechnic Institute and State University. University Libraries^^Virginia Polytechnic Institute and State University. University Libraries. Special Collections Department (Repository)","Estate of Leonard J. Currie","Reconstruction, Tikal, Guatemala","Guatemalan^^religious complexes^^ruins^^Maya^^religious buildings^^Leonard J. Currie Slides^^Central America^^Guatemala",,"Currie, Leonard J. (Leonard James), 1913-1996 (Photographer)",,,,,http://rightsstatements.org/vocab/InC-EDU/1.0/,"Virginia Tech Libraries Special Collections^^http://aspace.lib.vt.edu/repositories/2/resources/2315",,,Image,LJC_018_018,,,,,,,,,,,,,,,,,,,,,,,,,,,,,,,,,,,,"Central America,Currie - Leonard J,Guatemala,Guatemalan,Leonard J. Currie Slides,Maya,religious buildings,religious complexes,ruins",https://di.lib.vt.edu/files/original/Leonard_J._Currie_s_Slides_Collection/LJC_018_018/LJC_018_018.jpg,,"Central America",1,0
114,https://di.lib.vt.edu/items/show/114,,,,,"1972-09 (photo taken)",,,,,,,,,,,,,,"Leonard J. Currie Slides",,,,,"""Nigatsu-dō"", Wikipedia. Accessed 2018-02-05^^https://en.wikipedia.org/wiki/Nigatsu-d%C5%8D",,,,"color slides",,"Nara, Nara, Kinki, Japan",,,,,,,,,"Virginia Polytechnic Institute and State University. University Libraries^^Virginia Polytechnic Institute and State University. University Libraries. Special Collections Department (Repository)","Estate of Leonard J. Currie","Nigatsu-do, Todai-ji Temple, Nara","Japanese^^exterior views^^religious buildings^^porches^^religious complexes^^Asia^^Japan",,"Currie, Leonard J. (Leonard James), 1913-1996  (Photographer)",,,,,http://rightsstatements.org/vocab/InC-EDU/1.0/,"Virginia Tech Libraries Special Collections^^http://aspace.lib.vt.edu/repositories/2/resources/2315",image/jpeg,,Image,LJC_140_007,,,,,,,,,,,,,,,,,,,,,,,,,,,,,,,,,,,,"Asia,Currie - Leonard J,exterior views,Japan,Japanese,Leonard J. Currie Slides,porches,religious buildings,religious complexes",https://di.lib.vt.edu/files/original/Leonard_J._Currie_s_Slides_Collection/LJC_140_007/LJC_140_007.jpg,,Japan,1,0
113,https://di.lib.vt.edu/items/show/113,,,,,"1972-09 (photo taken)",,,,,,,,,,,,,,"Leonard J. Currie Slides",,,,,"""Nigatsu-dō"", Wikipedia. Accessed 2018-02-05^^https://en.wikipedia.org/wiki/Nigatsu-d%C5%8D",,,,"color slides",,"Nara, Nara, Kinki, Japan",,,,,,,,,"Virginia Polytechnic Institute and State University. University Libraries^^Virginia Polytechnic Institute and State University. University Libraries. Special Collections Department (Repository)","Estate of Leonard J. Currie","Nigatsu-do, Todai-ji Temple, Nara","Japanese^^exterior views^^religious buildings^^porches^^religious complexes^^Asia^^Japan",,"Currie, Leonard J. (Leonard James), 1913-1996  (Photographer)",,,,,http://rightsstatements.org/vocab/InC-EDU/1.0/,"Virginia Tech Libraries Special Collections^^http://aspace.lib.vt.edu/repositories/2/resources/2315",image/jpeg,,Image,LJC_140_006,,,,,,,,,,,,,,,,,,,,,,,,,,,,,,,,,,,,"Asia,Currie - Leonard J,exterior views,Japan,Japanese,Leonard J. Currie Slides,porches,religious buildings,religious complexes",https://di.lib.vt.edu/files/original/Leonard_J._Currie_s_Slides_Collection/LJC_140_006/LJC_140_006.jpg,,Japan,1,0
