﻿"Item Id","Item URI","Dublin Core:Alternative Title","Dublin Core:Abstract","Dublin Core:Table Of Contents","Dublin Core:Date Available","Dublin Core:Date Created","Dublin Core:Date Accepted","Dublin Core:Date Copyrighted","Dublin Core:Date Submitted","Dublin Core:Date Issued","Dublin Core:Date Modified","Dublin Core:Date Valid","Dublin Core:Access Rights","Dublin Core:License","Dublin Core:Conforms To","Dublin Core:Has Format","Dublin Core:Has Part","Dublin Core:Has Version","Dublin Core:Is Format Of","Dublin Core:Is Part Of","Dublin Core:Is Referenced By","Dublin Core:Is Replaced By","Dublin Core:Is Required By","Dublin Core:Is Version Of","Dublin Core:References","Dublin Core:Replaces","Dublin Core:Requires","Dublin Core:Extent","Dublin Core:Medium","Dublin Core:Bibliographic Citation","Dublin Core:Spatial Coverage","Dublin Core:Temporal Coverage","Dublin Core:Accrual Method","Dublin Core:Accrual Periodicity","Dublin Core:Accrual Policy","Dublin Core:Audience","Dublin Core:Audience Education Level","Dublin Core:Mediator","Dublin Core:Instructional Method","Dublin Core:Provenance","Dublin Core:Rights Holder","Dublin Core:Title","Dublin Core:Subject","Dublin Core:Description","Dublin Core:Creator","Dublin Core:Source","Dublin Core:Publisher","Dublin Core:Date","Dublin Core:Contributor","Dublin Core:Rights","Dublin Core:Relation","Dublin Core:Format","Dublin Core:Language","Dublin Core:Type","Dublin Core:Identifier","Dublin Core:Coverage","Item Type Metadata:Text","Item Type Metadata:Interviewer","Item Type Metadata:Interviewee","Item Type Metadata:Location","Item Type Metadata:Transcription","Item Type Metadata:Local URL","Item Type Metadata:Original Format","Item Type Metadata:Physical Dimensions","Item Type Metadata:Duration","Item Type Metadata:Compression","Item Type Metadata:Producer","Item Type Metadata:Director","Item Type Metadata:Bit Rate/Frequency","Item Type Metadata:Time Summary","Item Type Metadata:Email Body","Item Type Metadata:Subject Line","Item Type Metadata:From","Item Type Metadata:To","Item Type Metadata:CC","Item Type Metadata:BCC","Item Type Metadata:Number of Attachments","Item Type Metadata:Standards","Item Type Metadata:Objectives","Item Type Metadata:Materials","Item Type Metadata:Lesson Plan Text","Item Type Metadata:URL","Item Type Metadata:Event Type","Item Type Metadata:Participants","Item Type Metadata:Birth Date","Item Type Metadata:Birthplace","Item Type Metadata:Death Date","Item Type Metadata:Occupation","Item Type Metadata:Biographical Text","Item Type Metadata:Bibliography",tags,file,itemType,collection,public,featured
495,https://di.lib.vt.edu/items/show/495,,,,,"1951-12 (photo taken)",,,,,,,,,,,,,,"Leonard J. Currie Slides",,,,,,,,,"color slides",,"Bogotá, Bogotá, Distrito Capital de, Colombia",,,,,,,,,"Virginia Polytechnic Institute and State University. University Libraries^^Virginia Polytechnic Institute and State University. University Libraries. Special Collections Department (Repository)","Estate of Leonard J. Currie","Vac. Conc., Quiroga, Bogotá","Colombian^^construction (assembling)^^houses^^public housing^^residential structures^^row houses^^Leonard J. Currie Slides^^South America^^Colombia",,"Currie, Leonard J. (Leonard James), 1913-1996 (Photographer)",,,,,http://rightsstatements.org/vocab/InC-EDU/1.0/,"Virginia Tech Libraries Special Collections^^http://aspace.lib.vt.edu/repositories/2/resources/2315",,,Image,LJC_086_027,,,,,,,,,,,,,,,,,,,,,,,,,,,,,,,,,,,,"Colombia,construction (assembling),Currie - Leonard J,houses,Leonard J. Currie Slides,public housing,residential structures,row houses,South America",https://di.lib.vt.edu/files/original/Leonard_J._Currie_s_Slides_Collection/LJC_086_027/LJC_086_027.jpg,,Colombia,1,0
494,https://di.lib.vt.edu/items/show/494,,,,,"1951-12 (photo taken)",,,,,,,,,,,,,,"Leonard J. Currie Slides",,,,,,,,,"color slides",,"Bogotá, Bogotá, Distrito Capital de, Colombia",,,,,,,,,"Virginia Polytechnic Institute and State University. University Libraries^^Virginia Polytechnic Institute and State University. University Libraries. Special Collections Department (Repository)","Estate of Leonard J. Currie","Vac. Conc., Quiroga, Bogotá","Colombian^^construction (assembling)^^houses^^public housing^^residential structures^^row houses^^Leonard J. Currie Slides^^South America^^Colombia",,"Currie, Leonard J. (Leonard James), 1913-1996 (Photographer)",,,,,http://rightsstatements.org/vocab/InC-EDU/1.0/,"Virginia Tech Libraries Special Collections^^http://aspace.lib.vt.edu/repositories/2/resources/2315",,,Image,LJC_086_026,,,,,,,,,,,,,,,,,,,,,,,,,,,,,,,,,,,,"Colombia,construction (assembling),Currie - Leonard J,houses,Leonard J. Currie Slides,public housing,residential structures,row houses,South America",https://di.lib.vt.edu/files/original/Leonard_J._Currie_s_Slides_Collection/LJC_086_026/LJC_086_026.jpg,,Colombia,1,0
493,https://di.lib.vt.edu/items/show/493,,,,,"1951-12 (photo taken)",,,,,,,,,,,,,,"Leonard J. Currie Slides",,,,,,,,,"color slides",,"Bogotá, Bogotá, Distrito Capital de, Colombia",,,,,,,,,"Virginia Polytechnic Institute and State University. University Libraries^^Virginia Polytechnic Institute and State University. University Libraries. Special Collections Department (Repository)","Estate of Leonard J. Currie","Vac. Conc., Quiroga, Bogotá","Colombian^^construction (assembling)^^houses^^public housing^^residential structures^^Leonard J. Currie Slides^^South America^^Colombia",,"Currie, Leonard J. (Leonard James), 1913-1996 (Photographer)",,,,,http://rightsstatements.org/vocab/InC-EDU/1.0/,"Virginia Tech Libraries Special Collections^^http://aspace.lib.vt.edu/repositories/2/resources/2315",,,Image,LJC_086_025,,,,,,,,,,,,,,,,,,,,,,,,,,,,,,,,,,,,"Colombia,construction (assembling),Currie - Leonard J,houses,Leonard J. Currie Slides,public housing,residential structures,South America",https://di.lib.vt.edu/files/original/Leonard_J._Currie_s_Slides_Collection/LJC_086_025/LJC_086_025.jpg,,Colombia,1,0
489,https://di.lib.vt.edu/items/show/489,,,,,"1952-02 (photo taken)",,,,,,,,,,,,,,"Leonard J. Currie Slides",,,,,,,,,"color slides",,"Bogotá, Bogotá, Distrito Capital de, Colombia",,,,,,,,,"Virginia Polytechnic Institute and State University. University Libraries^^Virginia Polytechnic Institute and State University. University Libraries. Special Collections Department (Repository)","Estate of Leonard J. Currie","Vac. Conc., Quiroga, Bogotá","Colombian^^construction (assembling)^^houses^^public housing^^residential structures^^row houses^^Leonard J. Currie Slides^^South America^^Colombia",,"Currie, Leonard J. (Leonard James), 1913-1996 (Photographer)",,,,,http://rightsstatements.org/vocab/InC-EDU/1.0/,"Virginia Tech Libraries Special Collections^^http://aspace.lib.vt.edu/repositories/2/resources/2315",,,Image,LJC_086_018,,,,,,,,,,,,,,,,,,,,,,,,,,,,,,,,,,,,"Colombia,construction (assembling),Currie - Leonard J,houses,Leonard J. Currie Slides,public housing,residential structures,row houses,South America",https://di.lib.vt.edu/files/original/Leonard_J._Currie_s_Slides_Collection/LJC_086_018/LJC_086_018.jpg,,Colombia,1,0
488,https://di.lib.vt.edu/items/show/488,,,,,"1952-02 (photo taken)",,,,,,,,,,,,,,"Leonard J. Currie Slides",,,,,,,,,"color slides",,"Bogotá, Bogotá, Distrito Capital de, Colombia",,,,,,,,,"Virginia Polytechnic Institute and State University. University Libraries^^Virginia Polytechnic Institute and State University. University Libraries. Special Collections Department (Repository)","Estate of Leonard J. Currie","Vac. Conc., Quiroga, Bogotá","Colombian^^construction (assembling)^^houses^^public housing^^residential structures^^row houses^^Leonard J. Currie Slides^^South America^^Colombia",,"Currie, Leonard J. (Leonard James), 1913-1996 (Photographer)",,,,,http://rightsstatements.org/vocab/InC-EDU/1.0/,"Virginia Tech Libraries Special Collections^^http://aspace.lib.vt.edu/repositories/2/resources/2315",,,Image,LJC_086_017,,,,,,,,,,,,,,,,,,,,,,,,,,,,,,,,,,,,"Colombia,construction (assembling),Currie - Leonard J,houses,Leonard J. Currie Slides,public housing,residential structures,row houses,South America",https://di.lib.vt.edu/files/original/Leonard_J._Currie_s_Slides_Collection/LJC_086_017/LJC_086_017.jpg,,Colombia,1,0
487,https://di.lib.vt.edu/items/show/487,,,,,"1952-02 (photo taken)",,,,,,,,,,,,,,"Leonard J. Currie Slides",,,,,,,,,"color slides",,"Bogotá, Bogotá, Distrito Capital de, Colombia",,,,,,,,,"Virginia Polytechnic Institute and State University. University Libraries^^Virginia Polytechnic Institute and State University. University Libraries. Special Collections Department (Repository)","Estate of Leonard J. Currie","Vac. Conc., Quiroga, Bogotá","Colombian^^construction (assembling)^^houses^^public housing^^residential structures^^row houses^^Leonard J. Currie Slides^^South America^^Colombia",,"Currie, Leonard J. (Leonard James), 1913-1996 (Photographer)",,,,,http://rightsstatements.org/vocab/InC-EDU/1.0/,"Virginia Tech Libraries Special Collections^^http://aspace.lib.vt.edu/repositories/2/resources/2315",,,Image,LJC_086_016,,,,,,,,,,,,,,,,,,,,,,,,,,,,,,,,,,,,"Colombia,construction (assembling),Currie - Leonard J,houses,Leonard J. Currie Slides,public housing,residential structures,row houses,South America",https://di.lib.vt.edu/files/original/Leonard_J._Currie_s_Slides_Collection/LJC_086_016/LJC_086_016.jpg,,Colombia,1,0
486,https://di.lib.vt.edu/items/show/486,,,,,"1952-02 (photo taken)",,,,,,,,,,,,,,"Leonard J. Currie Slides",,,,,,,,,"color slides",,"Bogotá, Bogotá, Distrito Capital de, Colombia",,,,,,,,,"Virginia Polytechnic Institute and State University. University Libraries^^Virginia Polytechnic Institute and State University. University Libraries. Special Collections Department (Repository)","Estate of Leonard J. Currie","Vac. Conc., Quiroga, Bogotá","Colombian^^construction (assembling)^^houses^^residential structures^^public housing^^row houses^^Leonard J. Currie Slides^^South America^^Colombia",,"Currie, Leonard J. (Leonard James), 1913-1996 (Photographer)",,,,,http://rightsstatements.org/vocab/InC-EDU/1.0/,"Virginia Tech Libraries Special Collections^^http://aspace.lib.vt.edu/repositories/2/resources/2315",,,Image,LJC_086_015,,,,,,,,,,,,,,,,,,,,,,,,,,,,,,,,,,,,"Colombia,construction (assembling),Currie - Leonard J,houses,Leonard J. Currie Slides,public housing,residential structures,row houses,South America",https://di.lib.vt.edu/files/original/Leonard_J._Currie_s_Slides_Collection/LJC_086_015/LJC_086_015.jpg,,Colombia,1,0
502,https://di.lib.vt.edu/items/show/502,,,,,"1954-07 (photo taken)",,,,,,,,,,,,,,"Leonard J. Currie Slides",,,,,"Vivienda y concreto. Evolución de la vivienda popular en Bogotá.  Posted by Maarten GoossensMay 10, 2015. Accessed 2018-04-16,^^https://proyectodecada.wordpress.com/2015/05/10/vivienda-y-concreto-evolucion-de-la-vivienda-popular-en-bogota/",,,,"color slides",,"Bogotá, Bogotá, Distrito Capital de, Colombia",,,,,,,,,"Virginia Polytechnic Institute and State University. University Libraries^^Virginia Polytechnic Institute and State University. University Libraries. Special Collections Department (Repository)","Estate of Leonard J. Currie","Unidad Vecinale (Community Housing Project) Quiroga, Bogotá","Colombian^^houses^^residential structures^^public housing^^exterior views^^row houses^^Leonard J. Currie Slides^^South America^^Colombia",,"Currie, Leonard J. (Leonard James), 1913-1996 (Photographer)",,,,,http://rightsstatements.org/vocab/InC-EDU/1.0/,"Virginia Tech Libraries Special Collections^^http://aspace.lib.vt.edu/repositories/2/resources/2315",,,Image,LJC_086_054,,,,,,,,,,,,,,,,,,,,,,,,,,,,,,,,,,,,"Colombia,Currie - Leonard J,exterior views,houses,Leonard J. Currie Slides,public housing,residential structures,row houses,South America",https://di.lib.vt.edu/files/original/Leonard_J._Currie_s_Slides_Collection/LJC_086_054/LJC_086_054.jpg,,Colombia,1,0
504,https://di.lib.vt.edu/items/show/504,,,,,"1954-07 (photo taken)",,,,,,,,,,,,,,"Leonard J. Currie Slides",,,,,,,,,"color slides",,"Bogotá, Bogotá, Distrito Capital de, Colombia",,,,,,,,,"Virginia Polytechnic Institute and State University. University Libraries^^Virginia Polytechnic Institute and State University. University Libraries. Special Collections Department (Repository)","Estate of Leonard J. Currie","Unidad Vecinal (Community Housing Project) Quiroga, Bogotá","Colombian^^residential structures^^public housing^^entrances^^exterior views^^row houses^^houses^^Leonard J. Currie Slides^^South America^^Colombia",,"Currie, Leonard J. (Leonard James), 1913-1996 (Photographer)",,,,,http://rightsstatements.org/vocab/InC-EDU/1.0/,"Virginia Tech Libraries Special Collections^^http://aspace.lib.vt.edu/repositories/2/resources/2315",,,Image,LJC_086_056,,,,,,,,,,,,,,,,,,,,,,,,,,,,,,,,,,,,"Colombia,Currie - Leonard J,entrances,exterior views,houses,Leonard J. Currie Slides,public housing,residential structures,row houses,South America",https://di.lib.vt.edu/files/original/Leonard_J._Currie_s_Slides_Collection/LJC_086_056/LJC_086_056.jpg,,Colombia,1,0
503,https://di.lib.vt.edu/items/show/503,,,,,"1954-07 (photo taken)",,,,,,,,,,,,,,"Leonard J. Currie Slides",,,,,,,,,"color slides",,"Bogotá, Bogotá, Distrito Capital de, Colombia",,,,,,,,,"Virginia Polytechnic Institute and State University. University Libraries^^Virginia Polytechnic Institute and State University. University Libraries. Special Collections Department (Repository)","Estate of Leonard J. Currie","Unidad Vecinal (Community Housing Project) Quiroga, Bogotá","Colombian^^houses^^public housing^^residential structures^^exterior views^^row houses^^Leonard J. Currie Slides^^South America^^Colombia",,"Currie, Leonard J. (Leonard James), 1913-1996 (Photographer)",,,,,http://rightsstatements.org/vocab/InC-EDU/1.0/,"Virginia Tech Libraries Special Collections^^http://aspace.lib.vt.edu/repositories/2/resources/2315",,,Image,LJC_086_055,,,,,,,,,,,,,,,,,,,,,,,,,,,,,,,,,,,,"Colombia,Currie - Leonard J,exterior views,houses,Leonard J. Currie Slides,public housing,residential structures,row houses,South America",https://di.lib.vt.edu/files/original/Leonard_J._Currie_s_Slides_Collection/LJC_086_055/LJC_086_055.jpg,,Colombia,1,0
497,https://di.lib.vt.edu/items/show/497,,,,,"1953-02 (photo taken)",,,,,,,,,,,,,,"Leonard J. Currie Slides",,,,,,,,,"color slides",,"Bogotá, Bogotá, Distrito Capital de, Colombia",,,,,,,,,"Virginia Polytechnic Institute and State University. University Libraries^^Virginia Polytechnic Institute and State University. University Libraries. Special Collections Department (Repository)","Estate of Leonard J. Currie","Unidad Vecinal (Community Housing Project) Quiroga, Bogotá","Colombian^^exterior views^^construction (assembling)^^houses^^residential structures^^public housing^^row houses^^Leonard J. Currie Slides^^South America^^Colombia",,"Currie, Leonard J. (Leonard James), 1913-1996 (Photographer)",,,,,http://rightsstatements.org/vocab/InC-EDU/1.0/,"Virginia Tech Libraries Special Collections^^http://aspace.lib.vt.edu/repositories/2/resources/2315",,,Image,LJC_086_029,,,,,,,,,,,,,,,,,,,,,,,,,,,,,,,,,,,,"Colombia,construction (assembling),Currie - Leonard J,exterior views,houses,Leonard J. Currie Slides,public housing,residential structures,row houses,South America",https://di.lib.vt.edu/files/original/Leonard_J._Currie_s_Slides_Collection/LJC_086_029/LJC_086_029.jpg,,Colombia,1,0
485,https://di.lib.vt.edu/items/show/485,,,,,"1952-02 (photo taken)",,,,,,,,,,,,,,"Leonard J. Currie Slides",,,,,,,,,"color slides",,"Bogotá, Bogotá, Distrito Capital de, Colombia",,,,,,,,,"Virginia Polytechnic Institute and State University. University Libraries^^Virginia Polytechnic Institute and State University. University Libraries. Special Collections Department (Repository)","Estate of Leonard J. Currie","Unidad Vecinal (Community Housing Project) Quiroga, Bogotá","Colombian^^construction (assembling)^^houses^^public housing^^residential structures^^row houses^^Leonard J. Currie Slides^^South America^^Colombia",,"Currie, Leonard J. (Leonard James), 1913-1996 (Photographer)",,,,,http://rightsstatements.org/vocab/InC-EDU/1.0/,"Virginia Tech Libraries Special Collections^^http://aspace.lib.vt.edu/repositories/2/resources/2315",,,Image,LJC_086_014,,,,,,,,,,,,,,,,,,,,,,,,,,,,,,,,,,,,"Colombia,construction (assembling),Currie - Leonard J,houses,Leonard J. Currie Slides,public housing,residential structures,row houses,South America",https://di.lib.vt.edu/files/original/Leonard_J._Currie_s_Slides_Collection/LJC_086_014/LJC_086_014.jpg,,Colombia,1,0
484,https://di.lib.vt.edu/items/show/484,,,,,"1952-02 (photo taken)",,,,,,,,,,,,,,"Leonard J. Currie Slides",,,,,,,,,"color slides",,"Bogotá, Bogotá, Distrito Capital de, Colombia",,,,,,,,,"Virginia Polytechnic Institute and State University. University Libraries^^Virginia Polytechnic Institute and State University. University Libraries. Special Collections Department (Repository)","Estate of Leonard J. Currie","Unidad Vecinal (Community Housing Project) Quiroga, Bogotá","Colombian^^construction (assembling)^^exterior views^^houses^^public housing^^residential structures^^row houses^^Leonard J. Currie Slides^^South America^^Colombia",,"Currie, Leonard J. (Leonard James), 1913-1996 (Photographer)",,,,,http://rightsstatements.org/vocab/InC-EDU/1.0/,"Virginia Tech Libraries Special Collections^^http://aspace.lib.vt.edu/repositories/2/resources/2315",,,Image,LJC_086_013,,,,,,,,,,,,,,,,,,,,,,,,,,,,,,,,,,,,"Colombia,construction (assembling),Currie - Leonard J,exterior views,houses,Leonard J. Currie Slides,public housing,residential structures,row houses,South America",https://di.lib.vt.edu/files/original/Leonard_J._Currie_s_Slides_Collection/LJC_086_013/LJC_086_013.jpg,,Colombia,1,0
2138,https://di.lib.vt.edu/items/show/2138,,,,,"1956-07 (photo taken)",,,,,,,,,,,,,,,,,,,,,,,"color slides",,"Port-au-Prince, Ouest, Haiti",,,,,,,,,"Virginia Polytechnic Institute and State University. University Libraries^^Virginia Polytechnic Institute and State University. University Libraries. Special Collections Department (Repository)","Estate of Leonard J. Currie","Street, Port-au-Prince, Haiti","Haitian^^residential structures^^exterior views^^streets^^houses^^Leonard J. Currie Slides^^Caribbean^^Haiti",,"Currie, Leonard J. (Leonard James), 1913-1996 (Photographer)",,,,,http://rightsstatements.org/vocab/InC-EDU/1.0/,"Virginia Tech Libraries Special Collections^^http://aspace.lib.vt.edu/repositories/2/resources/2315",,,Image,LJC_098_023,,,,,,,,,,,,,,,,,,,,,,,,,,,,,,,,,,,,"Caribbean,Currie - Leonard J,exterior views,Haiti,Haitian,houses,Leonard J. Currie Slides,residential structures,streets",https://di.lib.vt.edu/files/original/Leonard_J._Currie_s_Slides_Collection/LJC_098_023/LJC_098_023.jpg,,"Central America",1,0
2101,https://di.lib.vt.edu/items/show/2101,,,,,"1965-07 (photo taken)",,,,,,,,,,,,,,,,,,,,,,,"color slides",,"Tikal, Petén, Guatemala",,,,,,,,,"Virginia Polytechnic Institute and State University. University Libraries^^Virginia Polytechnic Institute and State University. University Libraries. Special Collections Department (Repository)","Estate of Leonard J. Currie","Staff Quarters, Tikal, Guatemala","Guatemalan^^religious complexes^^ruins^^Maya^^exterior views^^residential structures^^houses^^Leonard J. Currie Slides^^Central America^^Guatemala",,"Currie, Leonard J. (Leonard James), 1913-1996 (Photographer)",,,,,http://rightsstatements.org/vocab/InC-EDU/1.0/,"Virginia Tech Libraries Special Collections^^http://aspace.lib.vt.edu/repositories/2/resources/2315",,,Image,LJC_018_009,,,,,,,,,,,,,,,,,,,,,,,,,,,,,,,,,,,,"Central America,Currie - Leonard J,exterior views,Guatemala,Guatemalan,houses,Leonard J. Currie Slides,Maya,religious complexes,residential structures,ruins",https://di.lib.vt.edu/files/original/Leonard_J._Currie_s_Slides_Collection/LJC_018_009/LJC_018_009.jpg,,"Central America",1,0
1982,https://di.lib.vt.edu/items/show/1982,,,,,"1973-08 (slide developed)",,,,,,,,,,,,,,,,,,,,,,,"color slides",,Spain,,,,,,,,,"Virginia Polytechnic Institute and State University. University Libraries^^Virginia Polytechnic Institute and State University. University Libraries. Special Collections Department (Repository)","Estate of Leonard J. Currie",Spain,"Spanish^^residential structures^^exterior views^^houses^^Leonard J. Currie Slides^^Europe^^Spain",,"Currie, Leonard J. (Leonard James), 1913-1996 (Photographer)",,,,,http://rightsstatements.org/vocab/InC-EDU/1.0/,"Virginia Tech Libraries Special Collections^^http://aspace.lib.vt.edu/repositories/2/resources/2315",,,Image,LJC_105_035,,,,,,,,,,,,,,,,,,,,,,,,,,,,,,,,,,,,"Currie - Leonard J,Europe,exterior views,houses,Leonard J. Currie Slides,residential structures,Spain,Spanish",https://di.lib.vt.edu/files/original/Leonard_J._Currie_s_Slides_Collection/LJC_105_035/LJC_105_035.jpg,,Spain,1,0
1981,https://di.lib.vt.edu/items/show/1981,,,,,"1973-08 (slide developed)",,,,,,,,,,,,,,,,,,,,,,,"color slides",,Spain,,,,,,,,,"Virginia Polytechnic Institute and State University. University Libraries^^Virginia Polytechnic Institute and State University. University Libraries. Special Collections Department (Repository)","Estate of Leonard J. Currie",Spain,"Spanish^^residential structures^^exterior views^^houses^^Leonard J. Currie Slides^^Europe^^Spain",,"Currie, Leonard J. (Leonard James), 1913-1996 (Photographer)",,,,,http://rightsstatements.org/vocab/InC-EDU/1.0/,"Virginia Tech Libraries Special Collections^^http://aspace.lib.vt.edu/repositories/2/resources/2315",,,Image,LJC_105_034,,,,,,,,,,,,,,,,,,,,,,,,,,,,,,,,,,,,"Currie - Leonard J,Europe,exterior views,houses,Leonard J. Currie Slides,residential structures,Spain,Spanish",https://di.lib.vt.edu/files/original/Leonard_J._Currie_s_Slides_Collection/LJC_105_034/LJC_105_034.jpg,,Spain,1,0
1972,https://di.lib.vt.edu/items/show/1972,,,,,"1973-05 (photo taken)",,,,,,,,,,,,,,,,,,,,,,,"color slides",,"Seville, Seville, Andalusia, Spain",,,,,,,,,"Virginia Polytechnic Institute and State University. University Libraries^^Virginia Polytechnic Institute and State University. University Libraries. Special Collections Department (Repository)","Estate of Leonard J. Currie",Spain,"Spanish^^exterior views^^landscape gardening^^residential structures^^Leonard J. Currie Slides^^Europe^^Spain","The box of slides is identified as Spain: UBEDA - CHURCH, ETC^^VIVIENDA EN SEVILLA^^ITALICA^^SANTIPONCE etc.","Currie, Leonard J. (Leonard James), 1913-1996 (Photographer)",,,,,http://rightsstatements.org/vocab/InC-EDU/1.0/,"Virginia Tech Libraries Special Collections^^http://aspace.lib.vt.edu/repositories/2/resources/2315",,,Image,LJC_132_035,,,,,,,,,,,,,,,,,,,,,,,,,,,,,,,,,,,,"Currie - Leonard J,Europe,exterior views,landscape gardening,Leonard J. Currie Slides,residential structures,Spain,Spanish",https://di.lib.vt.edu/files/original/Leonard_J._Currie_s_Slides_Collection/LJC_132_035/LJC_132_035.jpg,,Spain,1,0