﻿"Item Id","Item URI","Dublin Core:Alternative Title","Dublin Core:Abstract","Dublin Core:Table Of Contents","Dublin Core:Date Available","Dublin Core:Date Created","Dublin Core:Date Accepted","Dublin Core:Date Copyrighted","Dublin Core:Date Submitted","Dublin Core:Date Issued","Dublin Core:Date Modified","Dublin Core:Date Valid","Dublin Core:Access Rights","Dublin Core:License","Dublin Core:Conforms To","Dublin Core:Has Format","Dublin Core:Has Part","Dublin Core:Has Version","Dublin Core:Is Format Of","Dublin Core:Is Part Of","Dublin Core:Is Referenced By","Dublin Core:Is Replaced By","Dublin Core:Is Required By","Dublin Core:Is Version Of","Dublin Core:References","Dublin Core:Replaces","Dublin Core:Requires","Dublin Core:Extent","Dublin Core:Medium","Dublin Core:Bibliographic Citation","Dublin Core:Spatial Coverage","Dublin Core:Temporal Coverage","Dublin Core:Accrual Method","Dublin Core:Accrual Periodicity","Dublin Core:Accrual Policy","Dublin Core:Audience","Dublin Core:Audience Education Level","Dublin Core:Mediator","Dublin Core:Instructional Method","Dublin Core:Provenance","Dublin Core:Rights Holder","Dublin Core:Title","Dublin Core:Subject","Dublin Core:Description","Dublin Core:Creator","Dublin Core:Source","Dublin Core:Publisher","Dublin Core:Date","Dublin Core:Contributor","Dublin Core:Rights","Dublin Core:Relation","Dublin Core:Format","Dublin Core:Language","Dublin Core:Type","Dublin Core:Identifier","Dublin Core:Coverage","Item Type Metadata:Text","Item Type Metadata:Interviewer","Item Type Metadata:Interviewee","Item Type Metadata:Location","Item Type Metadata:Transcription","Item Type Metadata:Local URL","Item Type Metadata:Original Format","Item Type Metadata:Physical Dimensions","Item Type Metadata:Duration","Item Type Metadata:Compression","Item Type Metadata:Producer","Item Type Metadata:Director","Item Type Metadata:Bit Rate/Frequency","Item Type Metadata:Time Summary","Item Type Metadata:Email Body","Item Type Metadata:Subject Line","Item Type Metadata:From","Item Type Metadata:To","Item Type Metadata:CC","Item Type Metadata:BCC","Item Type Metadata:Number of Attachments","Item Type Metadata:Standards","Item Type Metadata:Objectives","Item Type Metadata:Materials","Item Type Metadata:Lesson Plan Text","Item Type Metadata:URL","Item Type Metadata:Event Type","Item Type Metadata:Participants","Item Type Metadata:Birth Date","Item Type Metadata:Birthplace","Item Type Metadata:Death Date","Item Type Metadata:Occupation","Item Type Metadata:Biographical Text","Item Type Metadata:Bibliography",tags,file,itemType,collection,public,featured
1590,https://di.lib.vt.edu/items/show/1590,,,,,"1976-07 (photo taken)",,,,,,,,,,,,,,,,,,,,,,,"color slides",,"Amalfi, Salerno, Campania, Italy",,,,,,,,,"Virginia Polytechnic Institute and State University. University Libraries^^Virginia Polytechnic Institute and State University. University Libraries. Special Collections Department (Repository)","Estate of Leonard J. Currie","Amalfi, Italy","Italian^^urban areas^^waterways^^seas^^Leonard J. Currie Slides^^Europe^^Italy",,"Currie, Leonard J. (Leonard James), 1913-1996 (Photographer)",,,,,http://rightsstatements.org/vocab/InC-EDU/1.0/,"Virginia Tech Libraries Special Collections^^http://aspace.lib.vt.edu/repositories/2/resources/2315",,,Image,LJC_138_084,,,,,,,,,,,,,,,,,,,,,,,,,,,,,,,,,,,,"Currie - Leonard J,Europe,Italian,Italy,Leonard J. Currie Slides,seas,urban areas,waterways",https://di.lib.vt.edu/files/original/Leonard_J._Currie_s_Slides_Collection/LJC_138_084/LJC_138_084.jpg,,Italy,1,0
2210,https://di.lib.vt.edu/items/show/2210,,,,,"1952-01 (photo taken)",,,,,,,,,,,,,,,,,,,,,,,"color slides",,"Cristóbal, Colón, Provincia de, Panama",,,,,,,,,"Virginia Polytechnic Institute and State University. University Libraries^^Virginia Polytechnic Institute and State University. University Libraries. Special Collections Department (Repository)","Estate of Leonard J. Currie",Cristobal,"Panamanian^^landscapes (environments)^^watercraft^^waterways^^seas^^harbors^^Leonard J. Currie Slides^^Central America^^Panama",,"Currie, Leonard J. (Leonard James), 1913-1996 (Photographer)",,,,,http://rightsstatements.org/vocab/InC-EDU/1.0/,"Virginia Tech Libraries Special Collections^^http://aspace.lib.vt.edu/repositories/2/resources/2315",,,Image,LJC_183_057,,,,,,,,,,,,,,,,,,,,,,,,,,,,,,,,,,,,"Central America,Currie - Leonard J,harbors,landscapes (environments),Leonard J. Currie Slides,Panama,Panamanian,seas,watercraft,waterways",https://di.lib.vt.edu/files/original/Leonard_J._Currie_s_Slides_Collection/LJC_183_057/LJC_183_057.jpg,,Panama,1,0
2211,https://di.lib.vt.edu/items/show/2211,,,,,"1952-01 (photo taken)",,,,,,,,,,,,,,,,,,,,,,,"color slides",,"Cristóbal, Colón, Provincia de, Panama",,,,,,,,,"Virginia Polytechnic Institute and State University. University Libraries^^Virginia Polytechnic Institute and State University. University Libraries. Special Collections Department (Repository)","Estate of Leonard J. Currie",Cristobal,"Panamanian^^landscapes (environments)^^watercraft^^waterways^^seas^^Leonard J. Currie Slides^^Central America^^Panama",,"Currie, Leonard J. (Leonard James), 1913-1996 (Photographer)",,,,,http://rightsstatements.org/vocab/InC-EDU/1.0/,"Virginia Tech Libraries Special Collections^^http://aspace.lib.vt.edu/repositories/2/resources/2315",,,Image,LJC_183_058,,,,,,,,,,,,,,,,,,,,,,,,,,,,,,,,,,,,"Central America,Currie - Leonard J,landscapes (environments),Leonard J. Currie Slides,Panama,Panamanian,seas,watercraft,waterways",https://di.lib.vt.edu/files/original/Leonard_J._Currie_s_Slides_Collection/LJC_183_058/LJC_183_058.jpg,,Panama,1,0
2209,https://di.lib.vt.edu/items/show/2209,,,,,"1952-01 (photo taken)",,,,,,,,,,,,,,,,,,,,,,,"color slides",,"Cristóbal, Colón, Provincia de, Panama",,,,,,,,,"Virginia Polytechnic Institute and State University. University Libraries^^Virginia Polytechnic Institute and State University. University Libraries. Special Collections Department (Repository)","Estate of Leonard J. Currie","Cristobal Pilot Boat","Panamanian^^watercraft^^waterways^^seas^^harbors^^Leonard J. Currie Slides^^Central America^^Panama",,"Currie, Leonard J. (Leonard James), 1913-1996 (Photographer)",,,,,http://rightsstatements.org/vocab/InC-EDU/1.0/,"Virginia Tech Libraries Special Collections^^http://aspace.lib.vt.edu/repositories/2/resources/2315",,,Image,LJC_183_056,,,,,,,,,,,,,,,,,,,,,,,,,,,,,,,,,,,,"Central America,Currie - Leonard J,harbors,Leonard J. Currie Slides,Panama,Panamanian,seas,watercraft,waterways",https://di.lib.vt.edu/files/original/Leonard_J._Currie_s_Slides_Collection/LJC_183_056/LJC_183_056.jpg,,Panama,1,0
2150,https://di.lib.vt.edu/items/show/2150,,,,,"1951-07 (photo taken)",,,,,,,,,,,,,,,,,,,,,,,"color slides",,"San Juan, San Juan, Puerto Rico",,,,,,,,,"Virginia Polytechnic Institute and State University. University Libraries^^Virginia Polytechnic Institute and State University. University Libraries. Special Collections Department (Repository)","Estate of Leonard J. Currie","From Condado Beach, San Juan, Puerto Rico","Puerto Rican^^landscapes (environments)^^waterways^^seas^^Leonard J. Currie Slides^^Caribbean^^Puerto Rico","Caribe-Hilton beyond","Currie, Leonard J. (Leonard James), 1913-1996 (Photographer)",,,,,http://rightsstatements.org/vocab/InC-EDU/1.0/,"Virginia Tech Libraries Special Collections^^http://aspace.lib.vt.edu/repositories/2/resources/2315",,,Image,LJC_086_004,,,,,,,,,,,,,,,,,,,,,,,,,,,,,,,,,,,,"Caribbean,Currie - Leonard J,landscapes (environments),Leonard J. Currie Slides,Puerto Rican,Puerto Rico,seas,waterways",https://di.lib.vt.edu/files/original/Leonard_J._Currie_s_Slides_Collection/LJC_086_004/LJC_086_004.jpg,,"Central America",1,0
2208,https://di.lib.vt.edu/items/show/2208,,,,,"1952-01 (photo taken)",,,,,,,,,,,,,,,,,,,,,,,"color slides",,"Cristóbal, Colón, Provincia de, Panama",,,,,,,,,"Virginia Polytechnic Institute and State University. University Libraries^^Virginia Polytechnic Institute and State University. University Libraries. Special Collections Department (Repository)","Estate of Leonard J. Currie","Grace Line - N.Y. to B.V. - approach to Cristobal, Canal Zone","Panamanian^^landscapes (environments)^^watercraft^^waterways^^seas^^harbors^^Leonard J. Currie Slides^^Central America^^Panama",,"Currie, Leonard J. (Leonard James), 1913-1996 (Photographer)",,,,,http://rightsstatements.org/vocab/InC-EDU/1.0/,"Virginia Tech Libraries Special Collections^^http://aspace.lib.vt.edu/repositories/2/resources/2315",,,Image,LJC_183_055,,,,,,,,,,,,,,,,,,,,,,,,,,,,,,,,,,,,"Central America,Currie - Leonard J,harbors,landscapes (environments),Leonard J. Currie Slides,Panama,Panamanian,seas,watercraft,waterways",https://di.lib.vt.edu/files/original/Leonard_J._Currie_s_Slides_Collection/LJC_183_055/LJC_183_055.jpg,,Panama,1,0
2182,https://di.lib.vt.edu/items/show/2182,,,,,"1952-01 (photo taken)",,,,,,,,,,,,,,,,,,,,,,,"color slides",,Panama,,,,,,,,,"Virginia Polytechnic Institute and State University. University Libraries^^Virginia Polytechnic Institute and State University. University Libraries. Special Collections Department (Repository)","Estate of Leonard J. Currie","Grace Line - N.Y. to B.V. - approach to Panama","Panamanian^^landscapes (environments)^^watercraft^^waterways^^seas^^Leonard J. Currie Slides^^Central America^^Panama",,"Currie, Leonard J. (Leonard James), 1913-1996 (Photographer)",,,,,http://rightsstatements.org/vocab/InC-EDU/1.0/,"Virginia Tech Libraries Special Collections^^http://aspace.lib.vt.edu/repositories/2/resources/2315",,,Image,LJC_183_054,,,,,,,,,,,,,,,,,,,,,,,,,,,,,,,,,,,,"Central America,Currie - Leonard J,landscapes (environments),Leonard J. Currie Slides,Panama,Panamanian,seas,watercraft,waterways",https://di.lib.vt.edu/files/original/Leonard_J._Currie_s_Slides_Collection/LJC_183_054/LJC_183_054.jpg,,Panama,1,0
630,https://di.lib.vt.edu/items/show/630,,,,,"1956-07 (photo taken)",,,,,,,,,,,,,,"Leonard J. Currie Slides",,,,,,,,,"color slides",,"Cartagena, Bolívar, Colombia",,,,,,,,,"Virginia Polytechnic Institute and State University. University Libraries^^Virginia Polytechnic Institute and State University. University Libraries. Special Collections Department (Repository)","Estate of Leonard J. Currie","La Popa, Cartagena, Colombia","Colombian^^religious complexes^^landscapes (environments)^^waterways^^seas^^Leonard J. Currie Slides^^South America^^Colombia",,"Currie, Leonard J. (Leonard James), 1913-1996 (Photographer)",,,,,http://rightsstatements.org/vocab/InC-EDU/1.0/,"Virginia Tech Libraries Special Collections^^http://aspace.lib.vt.edu/repositories/2/resources/2315",,,Image,LJC_097_022,,,,,,,,,,,,,,,,,,,,,,,,,,,,,,,,,,,,"Colombia,Currie - Leonard J,landscapes (environments),Leonard J. Currie Slides,religious complexes,seas,South America,waterways",https://di.lib.vt.edu/files/original/Leonard_J._Currie_s_Slides_Collection/LJC_097_022/LJC_097_022.jpg,,Colombia,1,0
2212,https://di.lib.vt.edu/items/show/2212,,,,,"1952-01 (photo taken)",,,,,,,,,,,,,,,,,,,,,,,"color slides",,"Cristóbal, Colón, Provincia de, Panama",,,,,,,,,"Virginia Polytechnic Institute and State University. University Libraries^^Virginia Polytechnic Institute and State University. University Libraries. Special Collections Department (Repository)","Estate of Leonard J. Currie","Near Cristobal","Panamanian^^landscapes (environments)^^watercraft^^waterways^^seas^^Leonard J. Currie Slides^^Central America^^Panama",,"Currie, Leonard J. (Leonard James), 1913-1996 (Photographer)",,,,,http://rightsstatements.org/vocab/InC-EDU/1.0/,"Virginia Tech Libraries Special Collections^^http://aspace.lib.vt.edu/repositories/2/resources/2315",,,Image,LJC_183_059,,,,,,,,,,,,,,,,,,,,,,,,,,,,,,,,,,,,"Central America,Currie - Leonard J,landscapes (environments),Leonard J. Currie Slides,Panama,Panamanian,seas,watercraft,waterways",https://di.lib.vt.edu/files/original/Leonard_J._Currie_s_Slides_Collection/LJC_183_059/LJC_183_059.jpg,,Panama,1,0
2213,https://di.lib.vt.edu/items/show/2213,,,,,"1952-01 (photo taken)",,,,,,,,,,,,,,,,,,,,,,,"color slides",,"Cristóbal, Colón, Provincia de, Panama",,,,,,,,,"Virginia Polytechnic Institute and State University. University Libraries^^Virginia Polytechnic Institute and State University. University Libraries. Special Collections Department (Repository)","Estate of Leonard J. Currie","Near Cristobal","Panamanian^^landscapes (environments)^^watercraft^^waterways^^seas^^harbors^^Leonard J. Currie Slides^^Central America^^Panama",,"Currie, Leonard J. (Leonard James), 1913-1996 (Photographer)",,,,,http://rightsstatements.org/vocab/InC-EDU/1.0/,"Virginia Tech Libraries Special Collections^^http://aspace.lib.vt.edu/repositories/2/resources/2315",,,Image,LJC_183_060,,,,,,,,,,,,,,,,,,,,,,,,,,,,,,,,,,,,"Central America,Currie - Leonard J,harbors,landscapes (environments),Leonard J. Currie Slides,Panama,Panamanian,seas,watercraft,waterways",https://di.lib.vt.edu/files/original/Leonard_J._Currie_s_Slides_Collection/LJC_183_060/LJC_183_060.jpg,,Panama,1,0
2120,https://di.lib.vt.edu/items/show/2120,,,,,"1956-07 (photo taken)",,,,,,,,,,,,,,,,,,,,,,,"color slides",,"Port-au-Prince, Ouest, Haiti",,,,,,,,,"Virginia Polytechnic Institute and State University. University Libraries^^Virginia Polytechnic Institute and State University. University Libraries. Special Collections Department (Repository)","Estate of Leonard J. Currie","View of Port-au-Prince, Haiti","Haitian^^urban areas^^waterways^^landscapes (environments)^^seas^^Leonard J. Currie Slides^^Caribbean^^Haiti",,"Currie, Leonard J. (Leonard James), 1913-1996 (Photographer)",,,,,http://rightsstatements.org/vocab/InC-EDU/1.0/,"Virginia Tech Libraries Special Collections^^http://aspace.lib.vt.edu/repositories/2/resources/2315",,,Image,LJC_098_004,,,,,,,,,,,,,,,,,,,,,,,,,,,,,,,,,,,,"Caribbean,Currie - Leonard J,Haiti,Haitian,landscapes (environments),Leonard J. Currie Slides,seas,urban areas,waterways",https://di.lib.vt.edu/files/original/Leonard_J._Currie_s_Slides_Collection/LJC_098_004/LJC_098_004.jpg,,"Central America",1,0
