﻿"Item Id","Item URI","Dublin Core:Alternative Title","Dublin Core:Abstract","Dublin Core:Table Of Contents","Dublin Core:Date Available","Dublin Core:Date Created","Dublin Core:Date Accepted","Dublin Core:Date Copyrighted","Dublin Core:Date Submitted","Dublin Core:Date Issued","Dublin Core:Date Modified","Dublin Core:Date Valid","Dublin Core:Access Rights","Dublin Core:License","Dublin Core:Conforms To","Dublin Core:Has Format","Dublin Core:Has Part","Dublin Core:Has Version","Dublin Core:Is Format Of","Dublin Core:Is Part Of","Dublin Core:Is Referenced By","Dublin Core:Is Replaced By","Dublin Core:Is Required By","Dublin Core:Is Version Of","Dublin Core:References","Dublin Core:Replaces","Dublin Core:Requires","Dublin Core:Extent","Dublin Core:Medium","Dublin Core:Bibliographic Citation","Dublin Core:Spatial Coverage","Dublin Core:Temporal Coverage","Dublin Core:Accrual Method","Dublin Core:Accrual Periodicity","Dublin Core:Accrual Policy","Dublin Core:Audience","Dublin Core:Audience Education Level","Dublin Core:Mediator","Dublin Core:Instructional Method","Dublin Core:Provenance","Dublin Core:Rights Holder","Dublin Core:Title","Dublin Core:Subject","Dublin Core:Description","Dublin Core:Creator","Dublin Core:Source","Dublin Core:Publisher","Dublin Core:Date","Dublin Core:Contributor","Dublin Core:Rights","Dublin Core:Relation","Dublin Core:Format","Dublin Core:Language","Dublin Core:Type","Dublin Core:Identifier","Dublin Core:Coverage","Item Type Metadata:Text","Item Type Metadata:Interviewer","Item Type Metadata:Interviewee","Item Type Metadata:Location","Item Type Metadata:Transcription","Item Type Metadata:Local URL","Item Type Metadata:Original Format","Item Type Metadata:Physical Dimensions","Item Type Metadata:Duration","Item Type Metadata:Compression","Item Type Metadata:Producer","Item Type Metadata:Director","Item Type Metadata:Bit Rate/Frequency","Item Type Metadata:Time Summary","Item Type Metadata:Email Body","Item Type Metadata:Subject Line","Item Type Metadata:From","Item Type Metadata:To","Item Type Metadata:CC","Item Type Metadata:BCC","Item Type Metadata:Number of Attachments","Item Type Metadata:Standards","Item Type Metadata:Objectives","Item Type Metadata:Materials","Item Type Metadata:Lesson Plan Text","Item Type Metadata:URL","Item Type Metadata:Event Type","Item Type Metadata:Participants","Item Type Metadata:Birth Date","Item Type Metadata:Birthplace","Item Type Metadata:Death Date","Item Type Metadata:Occupation","Item Type Metadata:Biographical Text","Item Type Metadata:Bibliography",tags,file,itemType,collection,public,featured
635,https://di.lib.vt.edu/items/show/635,,,,,"1956-07 (photo taken)",,,,,,,,,,,,,,"Leonard J. Currie Slides",,,,,,,,,"color slides",,"Cartagena, Bolívar, Colombia",,,,,,,,,"Virginia Polytechnic Institute and State University. University Libraries^^Virginia Polytechnic Institute and State University. University Libraries. Special Collections Department (Repository)","Estate of Leonard J. Currie","Old City, Cartagena, Colombia","Colombian^^religious buildings^^towers (building divisions)^^urban areas^^streets^^Leonard J. Currie Slides^^South America^^Colombia",,"Currie, Leonard J. (Leonard James), 1913-1996 (Photographer)",,,,,http://rightsstatements.org/vocab/InC-EDU/1.0/,"Virginia Tech Libraries Special Collections^^http://aspace.lib.vt.edu/repositories/2/resources/2315",,,Image,LJC_097_027,,,,,,,,,,,,,,,,,,,,,,,,,,,,,,,,,,,,"Colombia,Currie - Leonard J,Leonard J. Currie Slides,religious buildings,South America,streets,towers (building divisions),urban areas",https://di.lib.vt.edu/files/original/Leonard_J._Currie_s_Slides_Collection/LJC_097_027/LJC_097_027.jpg,,Colombia,1,0
3153,https://di.lib.vt.edu/items/show/3153,,,,,"1986-08 (slide developed)",,,,,,,,,,,,,,,,,,,,,,,"color slides",,"Blacksburg, Montgomery, Virginia, United States",,,,,,,,,"Virginia Polytechnic Institute and State University. University Libraries^^Virginia Polytechnic Institute and State University. University Libraries. Special Collections Department (Repository)","Estate of Leonard J. Currie","Ogburn House","American^^residential structures^^construction (assembling)^^exterior views^^streets^^houses^^Leonard J. Currie Slides^^Currie Projects^^Ogburn House",,"Currie, Leonard J. (Leonard James), 1913-1996 (Photographer)",,,,"Currie, Leonard J. (Leonard James), 1913-1996 (Architect)",http://rightsstatements.org/vocab/InC-EDU/1.0/,"Virginia Tech Libraries Special Collections^^http://aspace.lib.vt.edu/repositories/2/resources/2315",,,Image,LJC_143_020,,,,,,,,,,,,,,,,,,,,,,,,,,,,,,,,,,,,"American,construction (assembling),Currie - Leonard J,Currie Projects,exterior views,houses,Leonard J. Currie Slides,Ogburn House,residential structures,streets",https://di.lib.vt.edu/files/original/Leonard_J._Currie_s_Slides_Collection/LJC_143_020/LJC_143_020.jpg,,"United States",1,0
3152,https://di.lib.vt.edu/items/show/3152,,,,,"1986-08 (slide developed)",,,,,,,,,,,,,,,,,,,,,,,"color slides",,"Blacksburg, Montgomery, Virginia, United States",,,,,,,,,"Virginia Polytechnic Institute and State University. University Libraries^^Virginia Polytechnic Institute and State University. University Libraries. Special Collections Department (Repository)","Estate of Leonard J. Currie","Ogburn House","American^^residential structures^^construction (assembling)^^exterior views^^streets^^houses^^Leonard J. Currie Slides^^Currie Projects^^Ogburn House",,"Currie, Leonard J. (Leonard James), 1913-1996 (Photographer)",,,,"Currie, Leonard J. (Leonard James), 1913-1996 (Architect)",http://rightsstatements.org/vocab/InC-EDU/1.0/,"Virginia Tech Libraries Special Collections^^http://aspace.lib.vt.edu/repositories/2/resources/2315",,,Image,LJC_143_019,,,,,,,,,,,,,,,,,,,,,,,,,,,,,,,,,,,,"American,construction (assembling),Currie - Leonard J,Currie Projects,exterior views,houses,Leonard J. Currie Slides,Ogburn House,residential structures,streets",https://di.lib.vt.edu/files/original/Leonard_J._Currie_s_Slides_Collection/LJC_143_019/LJC_143_019.jpg,,"United States",1,0
3140,https://di.lib.vt.edu/items/show/3140,,,,,"1998-07 (slide developed)",,,,,,,,,,,,,,,,,,,,,,,"color slides",,"Blacksburg, Montgomery, Virginia, United States",,,,,,,,,"Virginia Polytechnic Institute and State University. University Libraries^^Virginia Polytechnic Institute and State University. University Libraries. Special Collections Department (Repository)","Estate of Leonard J. Currie","Ogburn House","American^^residential structures^^construction (assembling)^^exterior views^^streets^^houses^^Leonard J. Currie Slides^^Currie Projects^^Ogburn House",,"Currie, Leonard J. (Leonard James), 1913-1996 (Photographer)",,,,"Currie, Leonard J. (Leonard James), 1913-1996 (Architect)",http://rightsstatements.org/vocab/InC-EDU/1.0/,"Virginia Tech Libraries Special Collections^^http://aspace.lib.vt.edu/repositories/2/resources/2315",,,Image,LJC_143_007,,,,,,,,,,,,,,,,,,,,,,,,,,,,,,,,,,,,"American,construction (assembling),Currie - Leonard J,Currie Projects,exterior views,houses,Leonard J. Currie Slides,Ogburn House,residential structures,streets",https://di.lib.vt.edu/files/original/Leonard_J._Currie_s_Slides_Collection/LJC_143_007/LJC_143_007.jpg,,"United States",1,0
1404,https://di.lib.vt.edu/items/show/1404,,,,,"1973-08 (slide developed)",,,,,,,,,,,,,,,,,,,,,,,"color slides",,Nepal,,,,,,,,,"Virginia Polytechnic Institute and State University. University Libraries^^Virginia Polytechnic Institute and State University. University Libraries. Special Collections Department (Repository)","Estate of Leonard J. Currie",Nepal,"Nepalese^^vehicles (transportation)^^streets^^Leonard J. Currie Slides^^Asia^^Nepal",,"Currie, Leonard J. (Leonard James), 1913-1996 (Photographer)",,,,,http://rightsstatements.org/vocab/InC-EDU/1.0/,"Virginia Tech Libraries Special Collections^^http://aspace.lib.vt.edu/repositories/2/resources/2315",,,,LJC_116_028,,,,,,,,,,,,,,,,,,,,,,,,,,,,,,,,,,,,"Asia,Currie - Leonard J,Leonard J. Currie Slides,Nepal,Nepalese,streets,vehicles (transportation)",https://di.lib.vt.edu/files/original/19/LJC_116_028/LJC_116_028.jpg,,Nepal,1,0
1344,https://di.lib.vt.edu/items/show/1344,,,,,"1973-08 (slide developed)",,,,,,,,,,,,,,,,,,,,,,,"color slides",,Nepal,,,,,,,,,"Virginia Polytechnic Institute and State University. University Libraries^^Virginia Polytechnic Institute and State University. University Libraries. Special Collections Department (Repository)","Estate of Leonard J. Currie",Nepal,"Nepalese^^streets^^Leonard J. Currie Slides^^Asia^^Nepal",,"Currie, Leonard J. (Leonard James), 1913-1996 (Photographer)",,,,,http://rightsstatements.org/vocab/InC-EDU/1.0/,"Virginia Tech Libraries Special Collections^^http://aspace.lib.vt.edu/repositories/2/resources/2315",,,,LJC_114_024,,,,,,,,,,,,,,,,,,,,,,,,,,,,,,,,,,,,"Asia,Currie - Leonard J,Leonard J. Currie Slides,Nepal,Nepalese,streets",https://di.lib.vt.edu/files/original/19/LJC_114_024/LJC_114_024.jpg,,Nepal,1,0
1329,https://di.lib.vt.edu/items/show/1329,,,,,"1973-08 (slide developed)",,,,,,,,,,,,,,,,,,,,,,,"color slides",,Nepal,,,,,,,,,"Virginia Polytechnic Institute and State University. University Libraries^^Virginia Polytechnic Institute and State University. University Libraries. Special Collections Department (Repository)","Estate of Leonard J. Currie",Nepal,"Nepalese^^streets^^Leonard J. Currie Slides^^Asia^^Nepal",,"Currie, Leonard J. (Leonard James), 1913-1996 (Photographer)",,,,,http://rightsstatements.org/vocab/InC-EDU/1.0/,"Virginia Tech Libraries Special Collections^^http://aspace.lib.vt.edu/repositories/2/resources/2315",,,,LJC_114_009,,,,,,,,,,,,,,,,,,,,,,,,,,,,,,,,,,,,"Asia,Currie - Leonard J,Leonard J. Currie Slides,Nepal,Nepalese,streets",https://di.lib.vt.edu/files/original/19/LJC_114_009/LJC_114_009.jpg,,Nepal,1,0
1318,https://di.lib.vt.edu/items/show/1318,,,,,"1973-08 (slide developed)",,,,,,,,,,,,,,,,,,,,,,,"color slides",,Nepal,,,,,,,,,"Virginia Polytechnic Institute and State University. University Libraries^^Virginia Polytechnic Institute and State University. University Libraries. Special Collections Department (Repository)","Estate of Leonard J. Currie",Nepal,"Nepalese^^streets^^Leonard J. Currie Slides^^Asia^^Nepal",,"Currie, Leonard J. (Leonard James), 1913-1996 (Photographer)",,,,,http://rightsstatements.org/vocab/InC-EDU/1.0/,"Virginia Tech Libraries Special Collections^^http://aspace.lib.vt.edu/repositories/2/resources/2315",,,,LJC_113_016,,,,,,,,,,,,,,,,,,,,,,,,,,,,,,,,,,,,"Asia,Currie - Leonard J,Leonard J. Currie Slides,Nepal,Nepalese,streets",https://di.lib.vt.edu/files/original/19/LJC_113_016/LJC_113_016.jpg,,Nepal,1,0
1313,https://di.lib.vt.edu/items/show/1313,,,,,"1973-08 (slide developed)",,,,,,,,,,,,,,,,,,,,,,,"color slides",,Nepal,,,,,,,,,"Virginia Polytechnic Institute and State University. University Libraries^^Virginia Polytechnic Institute and State University. University Libraries. Special Collections Department (Repository)","Estate of Leonard J. Currie",Nepal,"Nepalese^^residential structures^^streets^^Leonard J. Currie Slides^^Asia^^Nepal",,"Currie, Leonard J. (Leonard James), 1913-1996 (Photographer)",,,,,http://rightsstatements.org/vocab/InC-EDU/1.0/,"Virginia Tech Libraries Special Collections^^http://aspace.lib.vt.edu/repositories/2/resources/2315",,,,LJC_113_011,,,,,,,,,,,,,,,,,,,,,,,,,,,,,,,,,,,,"Asia,Currie - Leonard J,Leonard J. Currie Slides,Nepal,Nepalese,residential structures,streets",https://di.lib.vt.edu/files/original/19/LJC_113_011/LJC_113_011.jpg,,Nepal,1,0
1092,https://di.lib.vt.edu/items/show/1092,,,,,"1974-10 (slide developed)",,,,,,,,,,,,,,"Leonard J. Currie Slides",,,,,,,,,"color slides",,"Cairo, Cairo, Egypt",,,,,,,,,"Virginia Polytechnic Institute and State University. University Libraries^^Virginia Polytechnic Institute and State University. University Libraries. Special Collections Department (Repository)","Estate of Leonard J. Currie","Khan El Khalili Bazaar","Egyptian (modern)^^streets^^marketplaces^^Leonard J. Currie Slides^^Africa^^Egypt",,"Currie, Leonard J. (Leonard James), 1913-1996 (Photographer)",,,,,http://rightsstatements.org/vocab/InC-EDU/1.0/,"Virginia Tech Libraries Special Collections^^http://aspace.lib.vt.edu/repositories/2/resources/2315",,,Image,LJC_107_025,,,,,,,,,,,,,,,,,,,,,,,,,,,,,,,,,,,,"Africa,Currie - Leonard J,Egypt,Egyptian (modern),Leonard J. Currie Slides,marketplaces,streets",https://di.lib.vt.edu/files/original/Leonard_J._Currie_s_Slides_Collection/LJC_107_025/LJC_107_025.jpg,,Egypt,1,0
1091,https://di.lib.vt.edu/items/show/1091,,,,,"1974-10 (slide developed)",,,,,,,,,,,,,,"Leonard J. Currie Slides",,,,,,,,,"color slides",,"Cairo, Cairo, Egypt",,,,,,,,,"Virginia Polytechnic Institute and State University. University Libraries^^Virginia Polytechnic Institute and State University. University Libraries. Special Collections Department (Repository)","Estate of Leonard J. Currie","Khan El Khalili Bazaar","Egyptian (modern)^^streets^^marketplaces^^Leonard J. Currie Slides^^Africa^^Egypt",,"Currie, Leonard J. (Leonard James), 1913-1996 (Photographer)",,,,,http://rightsstatements.org/vocab/InC-EDU/1.0/,"Virginia Tech Libraries Special Collections^^http://aspace.lib.vt.edu/repositories/2/resources/2315",,,Image,LJC_107_024,,,,,,,,,,,,,,,,,,,,,,,,,,,,,,,,,,,,"Africa,Currie - Leonard J,Egypt,Egyptian (modern),Leonard J. Currie Slides,marketplaces,streets",https://di.lib.vt.edu/files/original/Leonard_J._Currie_s_Slides_Collection/LJC_107_024/LJC_107_024.jpg,,Egypt,1,0
1139,https://di.lib.vt.edu/items/show/1139,,,,,"1974-10 (slide developed)",,,,,,,,,,,,,,"Leonard J. Currie Slides",,,,,,,,,"color slides",,"Luxor, Muḩāfaz̧at al Uqşur, Egypt",,,,,,,,,"Virginia Polytechnic Institute and State University. University Libraries^^Virginia Polytechnic Institute and State University. University Libraries. Special Collections Department (Repository)","Estate of Leonard J. Currie","Horse and Buggy, Luxor","Egyptian (modern)^^landscapes (environments)^^streets^^vehicles (transportation)^^domestic animals^^Leonard J. Currie Slides^^Africa^^Egypt",,"Currie, Leonard J. (Leonard James), 1913-1996 (Photographer)",,,,,http://rightsstatements.org/vocab/InC-EDU/1.0/,"Virginia Tech Libraries Special Collections^^http://aspace.lib.vt.edu/repositories/2/resources/2315",,,Image,LJC_107_018,,,,,,,,,,,,,,,,,,,,,,,,,,,,,,,,,,,,"Africa,Currie - Leonard J,domestic animals,Egypt,Egyptian (modern),landscapes (environments),Leonard J. Currie Slides,streets,vehicles (transportation)",https://di.lib.vt.edu/files/original/Leonard_J._Currie_s_Slides_Collection/LJC_107_018/LJC_107_018.jpg,,Egypt,1,0
1017,https://di.lib.vt.edu/items/show/1017,,,,,"1972-09 (photo taken)",,,,,,,,,,,,,,"Leonard J. Currie Slides",,,,,,,,,"color slides",,"Hong Kong, China",,,,,,,,,"Virginia Polytechnic Institute and State University. University Libraries^^Virginia Polytechnic Institute and State University. University Libraries. Special Collections Department (Repository)","Estate of Leonard J. Currie","Hong Kong City Center","Chinese^^streets^^urban areas^^Leonard J. Currie Slides^^Asia^^China",,"Currie, Leonard J. (Leonard James), 1913-1996 (Photographer)",,,,,http://rightsstatements.org/vocab/InC-EDU/1.0/,"Virginia Tech Libraries Special Collections^^http://aspace.lib.vt.edu/repositories/2/resources/2315",,,Image,LJC_135_004,,,,,,,,,,,,,,,,,,,,,,,,,,,,,,,,,,,,"Asia,China,Chinese,Currie - Leonard J,Leonard J. Currie Slides,streets,urban areas",https://di.lib.vt.edu/files/original/Leonard_J._Currie_s_Slides_Collection/LJC_135_004/LJC_135_004.jpg,,Asia,1,0
492,https://di.lib.vt.edu/items/show/492,,,,,"1952-07 (photo taken)",,,,,,,,,,,,,,"Leonard J. Currie Slides",,,,,,,,,"color slides",,"Espinal, Tolima, Colombia",,,,,,,,,"Virginia Polytechnic Institute and State University. University Libraries^^Virginia Polytechnic Institute and State University. University Libraries. Special Collections Department (Repository)","Estate of Leonard J. Currie","Espinal, Colombia","Colombian^^exterior views^^residential structures^^houses^^streets^^Leonard J. Currie Slides^^South America^^Colombia",,"Currie, Leonard J. (Leonard James), 1913-1996 (Photographer)",,,,,http://rightsstatements.org/vocab/InC-EDU/1.0/,"Virginia Tech Libraries Special Collections^^http://aspace.lib.vt.edu/repositories/2/resources/2315",,,Image,LJC_086_024,,,,,,,,,,,,,,,,,,,,,,,,,,,,,,,,,,,,"Colombia,Currie - Leonard J,exterior views,houses,Leonard J. Currie Slides,residential structures,South America,streets",https://di.lib.vt.edu/files/original/Leonard_J._Currie_s_Slides_Collection/LJC_086_024/LJC_086_024.jpg,,Colombia,1,0
1583,https://di.lib.vt.edu/items/show/1583,,,,,"1953-01 (photo taken)",,,,,,,,,,,,,,,,,,,,,,,"color slides",,"Cuzco, Cuzco, Peru",,,,,,,,,"Virginia Polytechnic Institute and State University. University Libraries^^Virginia Polytechnic Institute and State University. University Libraries. Special Collections Department (Repository)","Estate of Leonard J. Currie","Cusco, Peru","Peruvian^^streets^^Leonard J. Currie Slides^^South America^^Peru",,"Currie, Leonard J. (Leonard James), 1913-1996 (Photographer)",,,,,http://rightsstatements.org/vocab/InC-EDU/1.0/,"Virginia Tech Libraries Special Collections^^http://aspace.lib.vt.edu/repositories/2/resources/2315",,,Image,LJC_097_002,,,,,,,,,,,,,,,,,,,,,,,,,,,,,,,,,,,,"Currie - Leonard J,Leonard J. Currie Slides,Peru,Peruvian,South America,streets",https://di.lib.vt.edu/files/original/Leonard_J._Currie_s_Slides_Collection/LJC_097_002/LJC_097_002.jpg,,"South America",1,0
2807,https://di.lib.vt.edu/items/show/2807,,,,,"1984-01 (slide developed)",,,,,,,,,,,,,,,,,,,,,,,"color slides",,"Blacksburg, Montgomery, Virginia, United States",,,,,,,,,"Virginia Polytechnic Institute and State University. University Libraries^^Virginia Polytechnic Institute and State University. University Libraries. Special Collections Department (Repository)","Estate of Leonard J. Currie","Currie House II","American^^residential structures^^exterior views^^streets^^houses^^Currie House II (Blacksburg)^^Leonard J. Currie Slides^^Currie Projects^^Currie House II (Blacksburg) Completed",,"Currie, Leonard J. (Leonard James), 1913-1996 (Photographer)",,,,"Currie, Leonard J. (Leonard James), 1913-1996 (Architect)",http://rightsstatements.org/vocab/InC-EDU/1.0/,"Virginia Tech Libraries Special Collections^^http://aspace.lib.vt.edu/repositories/2/resources/2315",,,Image,LJC_016_010,,,,,,,,,,,,,,,,,,,,,,,,,,,,,,,,,,,,"American,Currie - Leonard J,Currie House II (Blacksburg),Currie House II (Blacksburg) Completed,Currie Projects,exterior views,houses,Leonard J. Currie Slides,residential structures,streets",https://di.lib.vt.edu/files/original/Leonard_J._Currie_s_Slides_Collection/LJC_016_010/LJC_016_010.jpg,,"United States",1,1
2806,https://di.lib.vt.edu/items/show/2806,,,,,"1984-01 (slide developed)",,,,,,,,,,,,,,,,,,,,,,,"color slides",,"Blacksburg, Montgomery, Virginia, United States",,,,,,,,,"Virginia Polytechnic Institute and State University. University Libraries^^Virginia Polytechnic Institute and State University. University Libraries. Special Collections Department (Repository)","Estate of Leonard J. Currie","Currie House II","American^^exterior views^^landscape gardening^^streets^^residential structures^^houses^^Currie House II (Blacksburg)^^Leonard J. Currie Slides^^Currie Projects^^Currie House II (Blacksburg) Completed",,"Currie, Leonard J. (Leonard James), 1913-1996 (Photographer)",,,,"Currie, Leonard J. (Leonard James), 1913-1996 (Architect)",http://rightsstatements.org/vocab/InC-EDU/1.0/,"Virginia Tech Libraries Special Collections^^http://aspace.lib.vt.edu/repositories/2/resources/2315",,,Image,LJC_016_009,,,,,,,,,,,,,,,,,,,,,,,,,,,,,,,,,,,,"American,Currie - Leonard J,Currie House II (Blacksburg),Currie House II (Blacksburg) Completed,Currie Projects,exterior views,houses,landscape gardening,Leonard J. Currie Slides,residential structures,streets",https://di.lib.vt.edu/files/original/Leonard_J._Currie_s_Slides_Collection/LJC_016_009/LJC_016_009.jpg,,"United States",1,1
2718,https://di.lib.vt.edu/items/show/2718,,,,,"1983-06 (photo taken)",,,,,,,,,,,,,,,,,,,,,,,"color slides",,"Blacksburg, Montgomery, Virginia, United States",,,,,,,,,"Virginia Polytechnic Institute and State University. University Libraries^^Virginia Polytechnic Institute and State University. University Libraries. Special Collections Department (Repository)","Estate of Leonard J. Currie","Currie House II","American^^residential structures^^exterior views^^streets^^houses^^Currie House II (Blacksburg)^^Leonard J. Currie Slides^^Currie Projects^^Currie House II (Blacksburg) Completed",,"Currie, Leonard J. (Leonard James), 1913-1996 (Photographer)",,,,"Currie, Leonard J. (Leonard James), 1913-1996 (Architect)",http://rightsstatements.org/vocab/InC-EDU/1.0/,"Virginia Tech Libraries Special Collections^^http://aspace.lib.vt.edu/repositories/2/resources/2315",,,Image,LJC_015_002,,,,,,,,,,,,,,,,,,,,,,,,,,,,,,,,,,,,"American,Currie - Leonard J,Currie House II (Blacksburg),Currie House II (Blacksburg) Completed,Currie Projects,exterior views,houses,Leonard J. Currie Slides,residential structures,streets",https://di.lib.vt.edu/files/original/Leonard_J._Currie_s_Slides_Collection/LJC_015_002/LJC_015_002.jpg,,"United States",1,1
2717,https://di.lib.vt.edu/items/show/2717,,,,,"1983-06 (photo taken)",,,,,,,,,,,,,,,,,,,,,,,"color slides",,"Blacksburg, Montgomery, Virginia, United States",,,,,,,,,"Virginia Polytechnic Institute and State University. University Libraries^^Virginia Polytechnic Institute and State University. University Libraries. Special Collections Department (Repository)","Estate of Leonard J. Currie","Currie House II","American^^exterior views^^landscape gardening^^streets^^residential structures^^houses^^Currie House II (Blacksburg)^^Leonard J. Currie Slides^^Currie Projects^^Currie House II (Blacksburg) Completed",,"Currie, Leonard J. (Leonard James), 1913-1996 (Photographer)",,,,"Currie, Leonard J. (Leonard James), 1913-1996 (Architect)",http://rightsstatements.org/vocab/InC-EDU/1.0/,"Virginia Tech Libraries Special Collections^^http://aspace.lib.vt.edu/repositories/2/resources/2315",,,Image,LJC_015_001,,,,,,,,,,,,,,,,,,,,,,,,,,,,,,,,,,,,"American,Currie - Leonard J,Currie House II (Blacksburg),Currie House II (Blacksburg) Completed,Currie Projects,exterior views,houses,landscape gardening,Leonard J. Currie Slides,residential structures,streets",https://di.lib.vt.edu/files/original/Leonard_J._Currie_s_Slides_Collection/LJC_015_001/LJC_015_001.jpg,,"United States",1,1
2701,https://di.lib.vt.edu/items/show/2701,,,,,"1981-11 (photo taken)",,,,,,,,,,,,,,,,,,,,,,,"color slides",,"Blacksburg, Montgomery, Virginia, United States",,,,,,,,,"Virginia Polytechnic Institute and State University. University Libraries^^Virginia Polytechnic Institute and State University. University Libraries. Special Collections Department (Repository)","Estate of Leonard J. Currie","Currie House II","American^^streets^^residential structures^^houses^^Currie House II (Blacksburg)^^Leonard J. Currie Slides^^Currie Projects^^Currie House II (Blacksburg) Completed",,"Currie, Leonard J. (Leonard James), 1913-1996 (Photographer)",,,,"Currie, Leonard J. (Leonard James), 1913-1996 (Architect)",http://rightsstatements.org/vocab/InC-EDU/1.0/,"Virginia Tech Libraries Special Collections^^http://aspace.lib.vt.edu/repositories/2/resources/2315",,,Image,LJC_001_071,,,,,,,,,,,,,,,,,,,,,,,,,,,,,,,,,,,,"American,Currie - Leonard J,Currie House II (Blacksburg),Currie House II (Blacksburg) Completed,Currie Projects,houses,Leonard J. Currie Slides,residential structures,streets",https://di.lib.vt.edu/files/original/Leonard_J._Currie_s_Slides_Collection/LJC_001_071/LJC_001_071.jpg,,"United States",1,1
