﻿"Item Id","Item URI","Dublin Core:Alternative Title","Dublin Core:Abstract","Dublin Core:Table Of Contents","Dublin Core:Date Available","Dublin Core:Date Created","Dublin Core:Date Accepted","Dublin Core:Date Copyrighted","Dublin Core:Date Submitted","Dublin Core:Date Issued","Dublin Core:Date Modified","Dublin Core:Date Valid","Dublin Core:Access Rights","Dublin Core:License","Dublin Core:Conforms To","Dublin Core:Has Format","Dublin Core:Has Part","Dublin Core:Has Version","Dublin Core:Is Format Of","Dublin Core:Is Part Of","Dublin Core:Is Referenced By","Dublin Core:Is Replaced By","Dublin Core:Is Required By","Dublin Core:Is Version Of","Dublin Core:References","Dublin Core:Replaces","Dublin Core:Requires","Dublin Core:Extent","Dublin Core:Medium","Dublin Core:Bibliographic Citation","Dublin Core:Spatial Coverage","Dublin Core:Temporal Coverage","Dublin Core:Accrual Method","Dublin Core:Accrual Periodicity","Dublin Core:Accrual Policy","Dublin Core:Audience","Dublin Core:Audience Education Level","Dublin Core:Mediator","Dublin Core:Instructional Method","Dublin Core:Provenance","Dublin Core:Rights Holder","Dublin Core:Title","Dublin Core:Subject","Dublin Core:Description","Dublin Core:Creator","Dublin Core:Source","Dublin Core:Publisher","Dublin Core:Date","Dublin Core:Contributor","Dublin Core:Rights","Dublin Core:Relation","Dublin Core:Format","Dublin Core:Language","Dublin Core:Type","Dublin Core:Identifier","Dublin Core:Coverage","Item Type Metadata:Text","Item Type Metadata:Interviewer","Item Type Metadata:Interviewee","Item Type Metadata:Location","Item Type Metadata:Transcription","Item Type Metadata:Local URL","Item Type Metadata:Original Format","Item Type Metadata:Physical Dimensions","Item Type Metadata:Duration","Item Type Metadata:Compression","Item Type Metadata:Producer","Item Type Metadata:Director","Item Type Metadata:Bit Rate/Frequency","Item Type Metadata:Time Summary","Item Type Metadata:Email Body","Item Type Metadata:Subject Line","Item Type Metadata:From","Item Type Metadata:To","Item Type Metadata:CC","Item Type Metadata:BCC","Item Type Metadata:Number of Attachments","Item Type Metadata:Standards","Item Type Metadata:Objectives","Item Type Metadata:Materials","Item Type Metadata:Lesson Plan Text","Item Type Metadata:URL","Item Type Metadata:Event Type","Item Type Metadata:Participants","Item Type Metadata:Birth Date","Item Type Metadata:Birthplace","Item Type Metadata:Death Date","Item Type Metadata:Occupation","Item Type Metadata:Biographical Text","Item Type Metadata:Bibliography",tags,file,itemType,collection,public,featured
2601,https://di.lib.vt.edu/items/show/2601,,,,,"1979-08 (slide developed)",,,,,,,,,,,,,,,,,,,,,,,"color slides",,"Chicago, Cook, Illinois, United States",,,,,,,,,"Virginia Polytechnic Institute and State University. University Libraries^^Virginia Polytechnic Institute and State University. University Libraries. Special Collections Department (Repository)","Estate of Leonard J. Currie","Chicago Fest, Summer1979","American^^events (activities)^^urban areas^^Leonard J. Currie Slides^^Chicago",,"Currie, Leonard J. (Leonard James), 1913-1996 (Photographer)",,,,,http://rightsstatements.org/vocab/InC-EDU/1.0/,"Virginia Tech Libraries Special Collections^^http://aspace.lib.vt.edu/repositories/2/resources/2315",,,Image,LJC_130_008,,,,,,,,,,,,,,,,,,,,,,,,,,,,,,,,,,,,"American,Chicago,Currie - Leonard J,events (activities),Leonard J. Currie Slides,urban areas",https://di.lib.vt.edu/files/original/Leonard_J._Currie_s_Slides_Collection/LJC_130_008/LJC_130_008.jpg,,"United States",1,1
2602,https://di.lib.vt.edu/items/show/2602,,,,,"1979-08 (slide developed)",,,,,,,,,,,,,,,,,,,,,,,"color slides",,"Chicago, Cook, Illinois, United States",,,,,,,,,"Virginia Polytechnic Institute and State University. University Libraries^^Virginia Polytechnic Institute and State University. University Libraries. Special Collections Department (Repository)","Estate of Leonard J. Currie","Chicago Fest, Summer1979","American^^events (activities)^^urban areas^^Leonard J. Currie Slides^^Chicago",,"Currie, Leonard J. (Leonard James), 1913-1996 (Photographer)",,,,,http://rightsstatements.org/vocab/InC-EDU/1.0/,"Virginia Tech Libraries Special Collections^^http://aspace.lib.vt.edu/repositories/2/resources/2315",,,Image,LJC_130_009,,,,,,,,,,,,,,,,,,,,,,,,,,,,,,,,,,,,"American,Chicago,Currie - Leonard J,events (activities),Leonard J. Currie Slides,urban areas",https://di.lib.vt.edu/files/original/Leonard_J._Currie_s_Slides_Collection/LJC_130_009/LJC_130_009.jpg,,"United States",1,1
2603,https://di.lib.vt.edu/items/show/2603,,,,,"1979-08 (slide developed)",,,,,,,,,,,,,,,,,,,,,,,"color slides",,"Chicago, Cook, Illinois, United States",,,,,,,,,"Virginia Polytechnic Institute and State University. University Libraries^^Virginia Polytechnic Institute and State University. University Libraries. Special Collections Department (Repository)","Estate of Leonard J. Currie","Chicago Fest, Summer1979","American^^events (activities)^^urban areas^^Leonard J. Currie Slides^^Chicago",,"Currie, Leonard J. (Leonard James), 1913-1996 (Photographer)",,,,,http://rightsstatements.org/vocab/InC-EDU/1.0/,"Virginia Tech Libraries Special Collections^^http://aspace.lib.vt.edu/repositories/2/resources/2315",,,Image,LJC_130_010,,,,,,,,,,,,,,,,,,,,,,,,,,,,,,,,,,,,"American,Chicago,Currie - Leonard J,events (activities),Leonard J. Currie Slides,urban areas",https://di.lib.vt.edu/files/original/Leonard_J._Currie_s_Slides_Collection/LJC_130_010/LJC_130_010.jpg,,"United States",1,1
2604,https://di.lib.vt.edu/items/show/2604,,,,,"1979-08 (slide developed)",,,,,,,,,,,,,,,,,,,,,,,"color slides",,"Chicago, Cook, Illinois, United States",,,,,,,,,"Virginia Polytechnic Institute and State University. University Libraries^^Virginia Polytechnic Institute and State University. University Libraries. Special Collections Department (Repository)","Estate of Leonard J. Currie","Chicago Fest, Summer1979","American^^events (activities)^^urban areas^^Leonard J. Currie Slides^^Chicago",,"Currie, Leonard J. (Leonard James), 1913-1996 (Photographer)",,,,,http://rightsstatements.org/vocab/InC-EDU/1.0/,"Virginia Tech Libraries Special Collections^^http://aspace.lib.vt.edu/repositories/2/resources/2315",,,Image,LJC_130_011,,,,,,,,,,,,,,,,,,,,,,,,,,,,,,,,,,,,"American,Chicago,Currie - Leonard J,events (activities),Leonard J. Currie Slides,urban areas",https://di.lib.vt.edu/files/original/Leonard_J._Currie_s_Slides_Collection/LJC_130_011/LJC_130_011.jpg,,"United States",1,1
2605,https://di.lib.vt.edu/items/show/2605,,,,,"1979-08 (slide developed)",,,,,,,,,,,,,,,,,,,,,,,"color slides",,"Chicago, Cook, Illinois, United States",,,,,,,,,"Virginia Polytechnic Institute and State University. University Libraries^^Virginia Polytechnic Institute and State University. University Libraries. Special Collections Department (Repository)","Estate of Leonard J. Currie","Chicago Fest, Summer1979","American^^events (activities)^^urban areas^^Leonard J. Currie Slides^^Chicago",,"Currie, Leonard J. (Leonard James), 1913-1996 (Photographer)",,,,,http://rightsstatements.org/vocab/InC-EDU/1.0/,"Virginia Tech Libraries Special Collections^^http://aspace.lib.vt.edu/repositories/2/resources/2315",,,Image,LJC_130_012,,,,,,,,,,,,,,,,,,,,,,,,,,,,,,,,,,,,"American,Chicago,Currie - Leonard J,events (activities),Leonard J. Currie Slides,urban areas",https://di.lib.vt.edu/files/original/Leonard_J._Currie_s_Slides_Collection/LJC_130_012/LJC_130_012.jpg,,"United States",1,1
2606,https://di.lib.vt.edu/items/show/2606,,,,,"1979-08 (slide developed)",,,,,,,,,,,,,,,,,,,,,,,"color slides",,"Chicago, Cook, Illinois, United States",,,,,,,,,"Virginia Polytechnic Institute and State University. University Libraries^^Virginia Polytechnic Institute and State University. University Libraries. Special Collections Department (Repository)","Estate of Leonard J. Currie","Chicago Fest, Summer1979","American^^events (activities)^^urban areas^^Leonard J. Currie Slides^^Chicago",,"Currie, Leonard J. (Leonard James), 1913-1996 (Photographer)",,,,,http://rightsstatements.org/vocab/InC-EDU/1.0/,"Virginia Tech Libraries Special Collections^^http://aspace.lib.vt.edu/repositories/2/resources/2315",,,Image,LJC_130_013,,,,,,,,,,,,,,,,,,,,,,,,,,,,,,,,,,,,"American,Chicago,Currie - Leonard J,events (activities),Leonard J. Currie Slides,urban areas",https://di.lib.vt.edu/files/original/Leonard_J._Currie_s_Slides_Collection/LJC_130_013/LJC_130_013.jpg,,"United States",1,1
2607,https://di.lib.vt.edu/items/show/2607,,,,,"1979-08 (slide developed)",,,,,,,,,,,,,,,,,,,,,,,"color slides",,"Chicago, Cook, Illinois, United States",,,,,,,,,"Virginia Polytechnic Institute and State University. University Libraries^^Virginia Polytechnic Institute and State University. University Libraries. Special Collections Department (Repository)","Estate of Leonard J. Currie","Chicago Fest, Summer1979","American^^events (activities)^^urban areas^^Leonard J. Currie Slides^^Chicago",,"Currie, Leonard J. (Leonard James), 1913-1996 (Photographer)",,,,,http://rightsstatements.org/vocab/InC-EDU/1.0/,"Virginia Tech Libraries Special Collections^^http://aspace.lib.vt.edu/repositories/2/resources/2315",,,Image,LJC_130_014,,,,,,,,,,,,,,,,,,,,,,,,,,,,,,,,,,,,"American,Chicago,Currie - Leonard J,events (activities),Leonard J. Currie Slides,urban areas",https://di.lib.vt.edu/files/original/Leonard_J._Currie_s_Slides_Collection/LJC_130_014/LJC_130_014.jpg,,"United States",1,1
2608,https://di.lib.vt.edu/items/show/2608,,,,,"1979-08 (slide developed)",,,,,,,,,,,,,,,,,,,,,,,"color slides",,"Chicago, Cook, Illinois, United States",,,,,,,,,"Virginia Polytechnic Institute and State University. University Libraries^^Virginia Polytechnic Institute and State University. University Libraries. Special Collections Department (Repository)","Estate of Leonard J. Currie","Chicago, Summer 1979","American^^urban areas^^Leonard J. Currie Slides^^Chicago",,"Currie, Leonard J. (Leonard James), 1913-1996 (Photographer)",,,,,http://rightsstatements.org/vocab/InC-EDU/1.0/,"Virginia Tech Libraries Special Collections^^http://aspace.lib.vt.edu/repositories/2/resources/2315",,,Image,LJC_130_015,,,,,,,,,,,,,,,,,,,,,,,,,,,,,,,,,,,,"American,Chicago,Currie - Leonard J,Leonard J. Currie Slides,urban areas",https://di.lib.vt.edu/files/original/Leonard_J._Currie_s_Slides_Collection/LJC_130_015/LJC_130_015.jpg,,"United States",1,1
2623,https://di.lib.vt.edu/items/show/2623,,,,,"1979-08 (slide developed)",,,,,,,,,,,,,,,,,,,,,,,"color slides",,"Chicago, Cook, Illinois, United States",,,,,,,,,"Virginia Polytechnic Institute and State University. University Libraries^^Virginia Polytechnic Institute and State University. University Libraries. Special Collections Department (Repository)","Estate of Leonard J. Currie","Chicago, Summer 1979","American^^urban areas^^Leonard J. Currie Slides^^Chicago",,"Currie, Leonard J. (Leonard James), 1913-1996 (Photographer)",,,,,http://rightsstatements.org/vocab/InC-EDU/1.0/,"Virginia Tech Libraries Special Collections^^http://aspace.lib.vt.edu/repositories/2/resources/2315",,,Image,LJC_130_030,,,,,,,,,,,,,,,,,,,,,,,,,,,,,,,,,,,,"American,Chicago,Currie - Leonard J,Leonard J. Currie Slides,urban areas",https://di.lib.vt.edu/files/original/Leonard_J._Currie_s_Slides_Collection/LJC_130_030/LJC_130_030.jpg,,"United States",1,1
2079,https://di.lib.vt.edu/items/show/2079,,,,,"1975-09 (slide developed)",,,,,,,,,,,,,,,,,,,,,,,"color slides",,Guatemala,,,,,,,,,"Virginia Polytechnic Institute and State University. University Libraries^^Virginia Polytechnic Institute and State University. University Libraries. Special Collections Department (Repository)","Estate of Leonard J. Currie","Clothing vendor, Guatemala (?)","Guatemalan^^urban areas^^plumbing systems^^Leonard J. Currie Slides^^Central America^^Guatemala","Slide is from a box of slides labeled CORN ISL, NAGA, INCAE, GUAT-MIL. ACAD.","Currie, Leonard J. (Leonard James), 1913-1996 (Photographer)",,,,,http://rightsstatements.org/vocab/InC-EDU/1.0/,"Virginia Tech Libraries Special Collections^^http://aspace.lib.vt.edu/repositories/2/resources/2315",,,Image,LJC_136_002,,,,,,,,,,,,,,,,,,,,,,,,,,,,,,,,,,,,"Central America,Currie - Leonard J,Guatemala,Guatemalan,Leonard J. Currie Slides,plumbing systems,urban areas",https://di.lib.vt.edu/files/original/Leonard_J._Currie_s_Slides_Collection/LJC_136_002/LJC_136_002.jpg,,"Central America",1,0
612,https://di.lib.vt.edu/items/show/612,,,,,"1967-12 (slide developed)",,,,,,,,,,,,,,"Leonard J. Currie Slides",,,,,,,,,"color slides",,Colombia,,,,,,,,,"Virginia Polytechnic Institute and State University. University Libraries^^Virginia Polytechnic Institute and State University. University Libraries. Special Collections Department (Repository)","Estate of Leonard J. Currie",Colombia,"Colombian^^aerial photographs^^urban areas^^religious buildings^^towers (building divisions)^^Leonard J. Currie Slides^^South America^^Colombia","The box of slides is labeled Colomba. Tenza and air views--Cauca Valley, Shabana de Bogota, etc.","Currie, Leonard J. (Leonard James), 1913-1996 (Photographer)",,,,,http://rightsstatements.org/vocab/InC-EDU/1.0/,"Virginia Tech Libraries Special Collections^^http://aspace.lib.vt.edu/repositories/2/resources/2315",,,Image,LJC_094_013,,,,,,,,,,,,,,,,,,,,,,,,,,,,,,,,,,,,"aerial photographs,Colombia,Currie - Leonard J,Leonard J. Currie Slides,religious buildings,South America,towers (building divisions),urban areas",https://di.lib.vt.edu/files/original/Leonard_J._Currie_s_Slides_Collection/LJC_094_013/LJC_094_013.jpg,,Colombia,1,0
623,https://di.lib.vt.edu/items/show/623,,,,,"1967-12 (slide developed)",,,,,,,,,,,,,,"Leonard J. Currie Slides",,,,,,,,,"color slides",,Colombia,,,,,,,,,"Virginia Polytechnic Institute and State University. University Libraries^^Virginia Polytechnic Institute and State University. University Libraries. Special Collections Department (Repository)","Estate of Leonard J. Currie",Colombia,"Colombian^^aerial photographs^^landscapes (environments)^^urban areas^^Leonard J. Currie Slides^^South America^^Colombia","The box of slides is labeled Colomba. Tenza and air views--Cauca Valley, Shabana de Bogota, etc.","Currie, Leonard J. (Leonard James), 1913-1996 (Photographer)",,,,,http://rightsstatements.org/vocab/InC-EDU/1.0/,"Virginia Tech Libraries Special Collections^^http://aspace.lib.vt.edu/repositories/2/resources/2315",,,Image,LJC_094_024,,,,,,,,,,,,,,,,,,,,,,,,,,,,,,,,,,,,"aerial photographs,Colombia,Currie - Leonard J,landscapes (environments),Leonard J. Currie Slides,South America,urban areas",https://di.lib.vt.edu/files/original/Leonard_J._Currie_s_Slides_Collection/LJC_094_024/LJC_094_024.jpg,,Colombia,1,0
1107,https://di.lib.vt.edu/items/show/1107,,,,,"1974-09 (photo taken)",,,,,,,,,,,,,,"Leonard J. Currie Slides",,,,,,,,,"color slides",,"Cairo, Cairo, Egypt",,,,,,,,,"Virginia Polytechnic Institute and State University. University Libraries^^Virginia Polytechnic Institute and State University. University Libraries. Special Collections Department (Repository)","Estate of Leonard J. Currie","Coptic Christian Quarters, Cairo","Egyptian (modern)^^urban areas^^Coptic (Christianity)^^Leonard J. Currie Slides^^Africa^^Egypt",,"Currie, Leonard J. (Leonard James), 1913-1996 (Photographer)",,,,,http://rightsstatements.org/vocab/InC-EDU/1.0/,"Virginia Tech Libraries Special Collections^^http://aspace.lib.vt.edu/repositories/2/resources/2315",,,Image,LJC_111_007,,,,,,,,,,,,,,,,,,,,,,,,,,,,,,,,,,,,"Africa,Coptic (Christianity),Currie - Leonard J,Egypt,Egyptian (modern),Leonard J. Currie Slides,urban areas",https://di.lib.vt.edu/files/original/Leonard_J._Currie_s_Slides_Collection/LJC_111_007/LJC_111_007.jpg,,Egypt,1,0
2714,https://di.lib.vt.edu/items/show/2714,,,,,"1962-03 (photo taken)",,,,,,,,,,,,,,,,,,,,,,,"color slides",,"Blacksburg, Montgomery, Virginia, United States",,,,,,,,,"Virginia Polytechnic Institute and State University. University Libraries^^Virginia Polytechnic Institute and State University. University Libraries. Special Collections Department (Repository)","Estate of Leonard J. Currie","Currie House","American^^exterior views^^urban areas^^houses^^Leonard J. Currie Slides^^Currie Projects^^Currie House I (Blacksburg)^^Currie House I (Blacksburg) Completed","Colloquially the ""Pagoda House""^^Distant view of Currie House and Highland Park houses","Wiss, Henry H.  (Photographer)",,,,"Currie, Leonard J. (Leonard James), 1913-1996 (Architect)",http://rightsstatements.org/vocab/InC-EDU/1.0/,"Virginia Tech Libraries Special Collections^^http://aspace.lib.vt.edu/repositories/2/resources/2315",,,Image,LJC_001_084,,,,,,,,,,,,,,,,,,,,,,,,,,,,,,,,,,,,"American,Currie - Leonard J,Currie House I (Blacksburg),Currie House I (Blacksburg) Completed,Currie Projects,exterior views,houses,Leonard J. Currie Slides,urban areas,Wiss - Henry H",https://di.lib.vt.edu/files/original/Leonard_J._Currie_s_Slides_Collection/LJC_001_084/LJC_001_084.jpg,,"United States",1,1
3200,https://di.lib.vt.edu/items/show/3200,,,,,"1960/1961 (photo taken)",,,,,,,,,,,,,,,,,,,"National Register Final Nomination^^Selected Modernist Architects in Virginia: Biographical Sketches By Josh Howard^^http://www.dhr.virginia.gov/registers/Counties/Montgomery/150-0019_Currie_House_1994_Final_Nomination.pdf^^http://www.dhr.virginia.gov/NewDominion/ArchitectBios_Howard_Final.pdf",,,,"color slides",,"Blacksburg, Montgomery, Virginia, United States",,,,,,,,,"Virginia Polytechnic Institute and State University. University Libraries^^Virginia Polytechnic Institute and State University. University Libraries. Special Collections Department (Repository)","Estate of Leonard J. Currie","Currie House (1961)","American^^residential structures^^construction (assembling)^^exterior views^^urban areas^^houses^^Currie House I (Blacksburg) Construction^^Leonard J. Currie Slides^^Currie Projects","Currie House / Trower House / Colloquially the ""Pagoda House""^^distant view of house under construction","Currie, Leonard J. (Leonard James), 1913-1996 (Photographer)",,,,"Currie, Leonard J. (Leonard James), 1913-1996 (Architect)",http://rightsstatements.org/vocab/InC-EDU/1.0/,"Virginia Tech Libraries Special Collections^^http://aspace.lib.vt.edu/repositories/2/resources/2315",,,Image,LJC_148_028,,,,,,,,,,,,,,,,,,,,,,,,,,,,,,,,,,,,"American,construction (assembling),Currie - Leonard J,Currie House I (Blacksburg) Construction,Currie Projects,exterior views,houses,Leonard J. Currie Slides,residential structures,urban areas",https://di.lib.vt.edu/files/original/Leonard_J._Currie_s_Slides_Collection/LJC_148_028/LJC_148_028.jpg,,"United States",1,0
3203,https://di.lib.vt.edu/items/show/3203,,,,,"1961-07 (photo taken)",,,,,,,,,,,,,,,,,,,"National Register Final Nomination^^Selected Modernist Architects in Virginia: Biographical Sketches By Josh Howard^^http://www.dhr.virginia.gov/registers/Counties/Montgomery/150-0019_Currie_House_1994_Final_Nomination.pdf^^http://www.dhr.virginia.gov/NewDominion/ArchitectBios_Howard_Final.pdf",,,,"color slides",,"Blacksburg, Montgomery, Virginia, United States",,,,,,,,,"Virginia Polytechnic Institute and State University. University Libraries^^Virginia Polytechnic Institute and State University. University Libraries. Special Collections Department (Repository)","Estate of Leonard J. Currie","Currie House (1961)","American^^residential structures^^exterior views^^urban areas^^houses^^Currie House I (Blacksburg) Completed^^Leonard J. Currie Slides^^Currie House I (Blacksburg)","Currie House / Trower House / Colloquially the ""Pagoda House""^^distant view of the house","Clark, Don (Photographer)",,,,"Currie, Leonard J. (Leonard James), 1913-1996 (Architect)",http://rightsstatements.org/vocab/InC-EDU/1.0/,"Virginia Tech Libraries Special Collections^^http://aspace.lib.vt.edu/repositories/2/resources/2315",,,Image,LJC_148_031,,,,,,,,,,,,,,,,,,,,,,,,,,,,,,,,,,,,"American,Clark - Don,Currie - Leonard J,Currie House I (Blacksburg),Currie House I (Blacksburg) Completed,exterior views,houses,Leonard J. Currie Slides,residential structures,urban areas",https://di.lib.vt.edu/files/original/Leonard_J._Currie_s_Slides_Collection/LJC_148_031/LJC_148_031.jpg,,"United States",1,0
1585,https://di.lib.vt.edu/items/show/1585,,,,,"1953-01 (photo taken)",,,,,,,,,,,,,,,,,,,,,,,"color slides",,"Cuzco, Cuzco, Peru",,,,,,,,,"Virginia Polytechnic Institute and State University. University Libraries^^Virginia Polytechnic Institute and State University. University Libraries. Special Collections Department (Repository)","Estate of Leonard J. Currie","Cuzco, Peru","Peruvian^^exterior views^^religious buildings^^towers (building divisions)^^urban areas^^Leonard J. Currie Slides^^South America^^Peru",,"Currie, Leonard J. (Leonard James), 1913-1996 (Photographer)",,,,,http://rightsstatements.org/vocab/InC-EDU/1.0/,"Virginia Tech Libraries Special Collections^^http://aspace.lib.vt.edu/repositories/2/resources/2315",,,Image,LJC_097_029,,,,,,,,,,,,,,,,,,,,,,,,,,,,,,,,,,,,"Currie - Leonard J,exterior views,Leonard J. Currie Slides,Peru,Peruvian,religious buildings,South America,towers (building divisions),urban areas",https://di.lib.vt.edu/files/original/Leonard_J._Currie_s_Slides_Collection/LJC_097_029/LJC_097_029.jpg,,"South America",1,0
2115,https://di.lib.vt.edu/items/show/2115,,,,,"1951-09 (photo taken)",,,,,,,,,,,,,,,,,,,,,,,"color slides",,"Managua, Lago de, Nicaragua",,,,,,,,,"Virginia Polytechnic Institute and State University. University Libraries^^Virginia Polytechnic Institute and State University. University Libraries. Special Collections Department (Repository)","Estate of Leonard J. Currie","Distant View of Managua across Lake Managua, Nicaragua","Nicaraguan^^aerial photographs^^landscapes (environments)^^urban areas^^waterways^^lakes (bodies of water)^^Leonard J. Currie Slides^^Central America^^Nicaragua",,"Currie, Leonard J. (Leonard James), 1913-1996 (Photographer)",,,,,http://rightsstatements.org/vocab/InC-EDU/1.0/,"Virginia Tech Libraries Special Collections^^http://aspace.lib.vt.edu/repositories/2/resources/2315",,,Image,LJC_086_010,,,,,,,,,,,,,,,,,,,,,,,,,,,,,,,,,,,,"aerial photographs,Central America,Currie - Leonard J,lakes (bodies of water),landscapes (environments),Leonard J. Currie Slides,Nicaragua,Nicaraguan,urban areas,waterways",https://di.lib.vt.edu/files/original/Leonard_J._Currie_s_Slides_Collection/LJC_086_010/LJC_086_010.jpg,,"Central America",1,0
1015,https://di.lib.vt.edu/items/show/1015,,,,,"1972-09 (photo taken)",,,,,,,,,,,,,,"Leonard J. Currie Slides",,,,,,,,,"color slides",,"Hong Kong, China",,,,,,,,,"Virginia Polytechnic Institute and State University. University Libraries^^Virginia Polytechnic Institute and State University. University Libraries. Special Collections Department (Repository)","Estate of Leonard J. Currie","From the Peninsula Hotel","Chinese^^urban areas^^Leonard J. Currie Slides^^Asia^^China",,"Currie, Leonard J. (Leonard James), 1913-1996 (Photographer)",,,,,http://rightsstatements.org/vocab/InC-EDU/1.0/,"Virginia Tech Libraries Special Collections^^http://aspace.lib.vt.edu/repositories/2/resources/2315",,,Image,LJC_135_002,,,,,,,,,,,,,,,,,,,,,,,,,,,,,,,,,,,,"Asia,China,Chinese,Currie - Leonard J,Leonard J. Currie Slides,urban areas",https://di.lib.vt.edu/files/original/Leonard_J._Currie_s_Slides_Collection/LJC_135_002/LJC_135_002.jpg,,Asia,1,0