﻿"Item Id","Item URI","Dublin Core:Alternative Title","Dublin Core:Abstract","Dublin Core:Table Of Contents","Dublin Core:Date Available","Dublin Core:Date Created","Dublin Core:Date Accepted","Dublin Core:Date Copyrighted","Dublin Core:Date Submitted","Dublin Core:Date Issued","Dublin Core:Date Modified","Dublin Core:Date Valid","Dublin Core:Access Rights","Dublin Core:License","Dublin Core:Conforms To","Dublin Core:Has Format","Dublin Core:Has Part","Dublin Core:Has Version","Dublin Core:Is Format Of","Dublin Core:Is Part Of","Dublin Core:Is Referenced By","Dublin Core:Is Replaced By","Dublin Core:Is Required By","Dublin Core:Is Version Of","Dublin Core:References","Dublin Core:Replaces","Dublin Core:Requires","Dublin Core:Extent","Dublin Core:Medium","Dublin Core:Bibliographic Citation","Dublin Core:Spatial Coverage","Dublin Core:Temporal Coverage","Dublin Core:Accrual Method","Dublin Core:Accrual Periodicity","Dublin Core:Accrual Policy","Dublin Core:Audience","Dublin Core:Audience Education Level","Dublin Core:Mediator","Dublin Core:Instructional Method","Dublin Core:Provenance","Dublin Core:Rights Holder","Dublin Core:Title","Dublin Core:Subject","Dublin Core:Description","Dublin Core:Creator","Dublin Core:Source","Dublin Core:Publisher","Dublin Core:Date","Dublin Core:Contributor","Dublin Core:Rights","Dublin Core:Relation","Dublin Core:Format","Dublin Core:Language","Dublin Core:Type","Dublin Core:Identifier","Dublin Core:Coverage","Item Type Metadata:Text","Item Type Metadata:Interviewer","Item Type Metadata:Interviewee","Item Type Metadata:Location","Item Type Metadata:Transcription","Item Type Metadata:Local URL","Item Type Metadata:Original Format","Item Type Metadata:Physical Dimensions","Item Type Metadata:Duration","Item Type Metadata:Compression","Item Type Metadata:Producer","Item Type Metadata:Director","Item Type Metadata:Bit Rate/Frequency","Item Type Metadata:Time Summary","Item Type Metadata:Email Body","Item Type Metadata:Subject Line","Item Type Metadata:From","Item Type Metadata:To","Item Type Metadata:CC","Item Type Metadata:BCC","Item Type Metadata:Number of Attachments","Item Type Metadata:Standards","Item Type Metadata:Objectives","Item Type Metadata:Materials","Item Type Metadata:Lesson Plan Text","Item Type Metadata:URL","Item Type Metadata:Event Type","Item Type Metadata:Participants","Item Type Metadata:Birth Date","Item Type Metadata:Birthplace","Item Type Metadata:Death Date","Item Type Metadata:Occupation","Item Type Metadata:Biographical Text","Item Type Metadata:Bibliography",tags,file,itemType,collection,public,featured
496,https://di.lib.vt.edu/items/show/496,,,,,"1953-01 (photo taken)",,,,,,,,,,,,,,"Leonard J. Currie Slides",,,,,,,,,"color slides",,"Colombia^^5.542708,-72.923387",,,,,,,,,"Virginia Polytechnic Institute and State University. University Libraries^^Virginia Polytechnic Institute and State University. University Libraries. Special Collections Department (Repository)","Estate of Leonard J. Currie","Laguna de Tota","Colombian^^beaches^^genre (visual works)^^landscapes (environments)^^waterways^^lakes (bodies of water)^^Leonard J. Currie Slides^^South America^^Colombia",,"Currie, Leonard J. (Leonard James), 1913-1996 (Photographer)",,,,,http://rightsstatements.org/vocab/InC-EDU/1.0/,"Virginia Tech Libraries Special Collections^^http://aspace.lib.vt.edu/repositories/2/resources/2315",,,Image,LJC_086_028,,,,,,,,,,,,,,,,,,,,,,,,,,,,,,,,,,,,"beaches,Colombia,Currie - Leonard J,genre (visual works),lakes (bodies of water),landscapes (environments),Leonard J. Currie Slides,South America,waterways",https://di.lib.vt.edu/files/original/Leonard_J._Currie_s_Slides_Collection/LJC_086_028/LJC_086_028.jpg,,Colombia,1,0
604,https://di.lib.vt.edu/items/show/604,,,,,"1967-12 (slide developed)",,,,,,,,,,,,,,"Leonard J. Currie Slides",,,,,,,,,"color slides",,Colombia,,,,,,,,,"Virginia Polytechnic Institute and State University. University Libraries^^Virginia Polytechnic Institute and State University. University Libraries. Special Collections Department (Repository)","Estate of Leonard J. Currie",Colombia,"Colombian^^landscapes (environments)^^watercraft^^waterways^^rivers^^Leonard J. Currie Slides^^South America^^Colombia","The box of slides is labeled Colomba. Tenza and air views--Cauca Valley, Shabana de Bogota, etc.","Currie, Leonard J. (Leonard James), 1913-1996 (Photographer)",,,,,http://rightsstatements.org/vocab/InC-EDU/1.0/,"Virginia Tech Libraries Special Collections^^http://aspace.lib.vt.edu/repositories/2/resources/2315",,,Image,LJC_094_005,,,,,,,,,,,,,,,,,,,,,,,,,,,,,,,,,,,,"Colombia,Currie - Leonard J,landscapes (environments),Leonard J. Currie Slides,rivers,South America,watercraft,waterways",https://di.lib.vt.edu/files/original/Leonard_J._Currie_s_Slides_Collection/LJC_094_005/LJC_094_005.jpg,,Colombia,1,0
630,https://di.lib.vt.edu/items/show/630,,,,,"1956-07 (photo taken)",,,,,,,,,,,,,,"Leonard J. Currie Slides",,,,,,,,,"color slides",,"Cartagena, Bolívar, Colombia",,,,,,,,,"Virginia Polytechnic Institute and State University. University Libraries^^Virginia Polytechnic Institute and State University. University Libraries. Special Collections Department (Repository)","Estate of Leonard J. Currie","La Popa, Cartagena, Colombia","Colombian^^religious complexes^^landscapes (environments)^^waterways^^seas^^Leonard J. Currie Slides^^South America^^Colombia",,"Currie, Leonard J. (Leonard James), 1913-1996 (Photographer)",,,,,http://rightsstatements.org/vocab/InC-EDU/1.0/,"Virginia Tech Libraries Special Collections^^http://aspace.lib.vt.edu/repositories/2/resources/2315",,,Image,LJC_097_022,,,,,,,,,,,,,,,,,,,,,,,,,,,,,,,,,,,,"Colombia,Currie - Leonard J,landscapes (environments),Leonard J. Currie Slides,religious complexes,seas,South America,waterways",https://di.lib.vt.edu/files/original/Leonard_J._Currie_s_Slides_Collection/LJC_097_022/LJC_097_022.jpg,,Colombia,1,0
643,https://di.lib.vt.edu/items/show/643,,,,,"1956-07 (photo taken)",,,,,,,,,,,,,,"Leonard J. Currie Slides",,,,,,,,,"color slides",,"Cartagena, Bolívar, Colombia",,,,,,,,,"Virginia Polytechnic Institute and State University. University Libraries^^Virginia Polytechnic Institute and State University. University Libraries. Special Collections Department (Repository)","Estate of Leonard J. Currie","La Boquilla, Cartagena, Colombia","Colombian^^watercraft^^waterways^^beaches^^landscapes (environments)^^swamps^^Leonard J. Currie Slides^^South America^^Colombia",,"Currie, Leonard J. (Leonard James), 1913-1996 (Photographer)",,,,,http://rightsstatements.org/vocab/InC-EDU/1.0/,"Virginia Tech Libraries Special Collections^^http://aspace.lib.vt.edu/repositories/2/resources/2315",,,Image,LJC_101_006,,,,,,,,,,,,,,,,,,,,,,,,,,,,,,,,,,,,"beaches,Colombia,Currie - Leonard J,landscapes (environments),Leonard J. Currie Slides,South America,swamps,watercraft,waterways",https://di.lib.vt.edu/files/original/Leonard_J._Currie_s_Slides_Collection/LJC_101_006/LJC_101_006.jpg,,Colombia,1,0
645,https://di.lib.vt.edu/items/show/645,,,,,"1956-07 (photo taken)",,,,,,,,,,,,,,"Leonard J. Currie Slides",,,,,,,,,"color slides",,"Cartagena, Bolívar, Colombia",,,,,,,,,"Virginia Polytechnic Institute and State University. University Libraries^^Virginia Polytechnic Institute and State University. University Libraries. Special Collections Department (Repository)","Estate of Leonard J. Currie","La Boquilla, Cartagena, Colombia","Colombian^^beaches^^waterways^^watercraft^^landscapes (environments)^^swamps^^Leonard J. Currie Slides^^South America^^Colombia",,"Currie, Leonard J. (Leonard James), 1913-1996 (Photographer)",,,,,http://rightsstatements.org/vocab/InC-EDU/1.0/,"Virginia Tech Libraries Special Collections^^http://aspace.lib.vt.edu/repositories/2/resources/2315",,,Image,LJC_101_008,,,,,,,,,,,,,,,,,,,,,,,,,,,,,,,,,,,,"beaches,Colombia,Currie - Leonard J,landscapes (environments),Leonard J. Currie Slides,South America,swamps,watercraft,waterways",https://di.lib.vt.edu/files/original/Leonard_J._Currie_s_Slides_Collection/LJC_101_008/LJC_101_008.jpg,,Colombia,1,0
648,https://di.lib.vt.edu/items/show/648,,,,,"1956-07 (photo taken)",,,,,,,,,,,,,,"Leonard J. Currie Slides",,,,,,,,,"color slides",,"Magdalena, Colombia",,,,,,,,,"Virginia Polytechnic Institute and State University. University Libraries^^Virginia Polytechnic Institute and State University. University Libraries. Special Collections Department (Repository)","Estate of Leonard J. Currie","Magdalena River, Colombia","Colombian^^landscapes (environments)^^waterways^^rivers^^Leonard J. Currie Slides^^South America^^Colombia","Selva (jungle)","Currie, Leonard J. (Leonard James), 1913-1996 (Photographer)",,,,,http://rightsstatements.org/vocab/InC-EDU/1.0/,"Virginia Tech Libraries Special Collections^^http://aspace.lib.vt.edu/repositories/2/resources/2315",,,Image,LJC_101_011,,,,,,,,,,,,,,,,,,,,,,,,,,,,,,,,,,,,"Colombia,Currie - Leonard J,landscapes (environments),Leonard J. Currie Slides,rivers,South America,waterways",https://di.lib.vt.edu/files/original/Leonard_J._Currie_s_Slides_Collection/LJC_101_011/LJC_101_011.jpg,,Colombia,1,0
651,https://di.lib.vt.edu/items/show/651,,,,,"1956-07 (photo taken)",,,,,,,,,,,,,,"Leonard J. Currie Slides",,,,,,,,,"color slides",,"Cartagena, Bolívar, Colombia",,,,,,,,,"Virginia Polytechnic Institute and State University. University Libraries^^Virginia Polytechnic Institute and State University. University Libraries. Special Collections Department (Repository)","Estate of Leonard J. Currie","Pescadores Club, Cartagena, Colombia","Colombian^^restaurants^^waterways^^beaches^^harbors^^Leonard J. Currie Slides^^South America^^Colombia",,"Currie, Leonard J. (Leonard James), 1913-1996 (Photographer)",,,,,http://rightsstatements.org/vocab/InC-EDU/1.0/,"Virginia Tech Libraries Special Collections^^http://aspace.lib.vt.edu/repositories/2/resources/2315",,,Image,LJC_101_014,,,,,,,,,,,,,,,,,,,,,,,,,,,,,,,,,,,,"beaches,Colombia,Currie - Leonard J,harbors,Leonard J. Currie Slides,restaurants,South America,waterways",https://di.lib.vt.edu/files/original/Leonard_J._Currie_s_Slides_Collection/LJC_101_014/LJC_101_014.jpg,,Colombia,1,0
660,https://di.lib.vt.edu/items/show/660,,,,,"1956-07 (photo taken)",,,,,,,,,,,,,,"Leonard J. Currie Slides",,,,,,,,,"color slides",,"Cartagena, Bolívar, Colombia",,,,,,,,,"Virginia Polytechnic Institute and State University. University Libraries^^Virginia Polytechnic Institute and State University. University Libraries. Special Collections Department (Repository)","Estate of Leonard J. Currie","Port, Cartagena, Colombia","Colombian^^waterways^^urban areas^^harbors^^Leonard J. Currie Slides^^South America^^Colombia",,"Currie, Leonard J. (Leonard James), 1913-1996 (Photographer)",,,,,http://rightsstatements.org/vocab/InC-EDU/1.0/,"Virginia Tech Libraries Special Collections^^http://aspace.lib.vt.edu/repositories/2/resources/2315",,,Image,LJC_101_023,,,,,,,,,,,,,,,,,,,,,,,,,,,,,,,,,,,,"Colombia,Currie - Leonard J,harbors,Leonard J. Currie Slides,South America,urban areas,waterways",https://di.lib.vt.edu/files/original/Leonard_J._Currie_s_Slides_Collection/LJC_101_023/LJC_101_023.jpg,,Colombia,1,0
973,https://di.lib.vt.edu/items/show/973,,,,,"1973-03-20/1973-03-24 (photo taken)",,,,,,,,,,,,,,"Leonard J. Currie Slides",,,,,,,,,"color slides",,"Bankok Metropolis, Thailand",,,,,,,,,"Virginia Polytechnic Institute and State University. University Libraries^^Virginia Polytechnic Institute and State University. University Libraries. Special Collections Department (Repository)","Estate of Leonard J. Currie",Bankok,"Thai^^watercraft^^waterways^^rivers^^Leonard J. Currie Slides^^Asia^^Thailand",,"Currie, Leonard J. (Leonard James), 1913-1996 (Photographer)",,,,,http://rightsstatements.org/vocab/InC-EDU/1.0/,"Virginia Tech Libraries Special Collections^^http://aspace.lib.vt.edu/repositories/2/resources/2315",,,Image,LJC_120_002,,,,,,,,,,,,,,,,,,,,,,,,,,,,,,,,,,,,"Asia,Currie - Leonard J,Leonard J. Currie Slides,rivers,Thai,Thailand,watercraft,waterways",https://di.lib.vt.edu/files/original/Leonard_J._Currie_s_Slides_Collection/LJC_120_002/LJC_120_002.jpg,,Asia,1,0
1016,https://di.lib.vt.edu/items/show/1016,,,,,"1972-09 (photo taken)",,,,,,,,,,,,,,"Leonard J. Currie Slides",,,,,,,,,"color slides",,"Hong Kong, China",,,,,,,,,"Virginia Polytechnic Institute and State University. University Libraries^^Virginia Polytechnic Institute and State University. University Libraries. Special Collections Department (Repository)","Estate of Leonard J. Currie","Hong Kong from the Peninsula Hotel","Chinese^^urban areas^^harbors^^waterways^^Leonard J. Currie Slides^^Asia^^China",,"Currie, Leonard J. (Leonard James), 1913-1996 (Photographer)",,,,,http://rightsstatements.org/vocab/InC-EDU/1.0/,"Virginia Tech Libraries Special Collections^^http://aspace.lib.vt.edu/repositories/2/resources/2315",,,Image,LJC_135_003,,,,,,,,,,,,,,,,,,,,,,,,,,,,,,,,,,,,"Asia,China,Chinese,Currie - Leonard J,harbors,Leonard J. Currie Slides,urban areas,waterways",https://di.lib.vt.edu/files/original/Leonard_J._Currie_s_Slides_Collection/LJC_135_003/LJC_135_003.jpg,,Asia,1,0
1018,https://di.lib.vt.edu/items/show/1018,,,,,"1972-09 (photo taken)",,,,,,,,,,,,,,"Leonard J. Currie Slides",,,,,,,,,"color slides",,"Hong Kong, China",,,,,,,,,"Virginia Polytechnic Institute and State University. University Libraries^^Virginia Polytechnic Institute and State University. University Libraries. Special Collections Department (Repository)","Estate of Leonard J. Currie","Hong Kong Harbor","Chinese^^landscapes (environments)^^waterways^^urban areas^^harbors^^Leonard J. Currie Slides^^Asia^^China",,"Currie, Leonard J. (Leonard James), 1913-1996 (Photographer)",,,,,http://rightsstatements.org/vocab/InC-EDU/1.0/,"Virginia Tech Libraries Special Collections^^http://aspace.lib.vt.edu/repositories/2/resources/2315",,,Image,LJC_135_005,,,,,,,,,,,,,,,,,,,,,,,,,,,,,,,,,,,,"Asia,China,Chinese,Currie - Leonard J,harbors,landscapes (environments),Leonard J. Currie Slides,urban areas,waterways",https://di.lib.vt.edu/files/original/Leonard_J._Currie_s_Slides_Collection/LJC_135_005/LJC_135_005.jpg,,Asia,1,0
1019,https://di.lib.vt.edu/items/show/1019,,,,,"1972-09 (photo taken)",,,,,,,,,,,,,,"Leonard J. Currie Slides",,,,,,,,,"color slides",,"Hong Kong, China",,,,,,,,,"Virginia Polytechnic Institute and State University. University Libraries^^Virginia Polytechnic Institute and State University. University Libraries. Special Collections Department (Repository)","Estate of Leonard J. Currie","Hong Kong Harbor","Chinese^^landscapes (environments)^^waterways^^urban areas^^harbors^^Leonard J. Currie Slides^^Asia^^China",,"Currie, Leonard J. (Leonard James), 1913-1996 (Photographer)",,,,,http://rightsstatements.org/vocab/InC-EDU/1.0/,"Virginia Tech Libraries Special Collections^^http://aspace.lib.vt.edu/repositories/2/resources/2315",,,Image,LJC_135_006,,,,,,,,,,,,,,,,,,,,,,,,,,,,,,,,,,,,"Asia,China,Chinese,Currie - Leonard J,harbors,landscapes (environments),Leonard J. Currie Slides,urban areas,waterways",https://di.lib.vt.edu/files/original/Leonard_J._Currie_s_Slides_Collection/LJC_135_006/LJC_135_006.jpg,,Asia,1,0
1020,https://di.lib.vt.edu/items/show/1020,,,,,"1972-09 (photo taken)",,,,,,,,,,,,,,"Leonard J. Currie Slides",,,,,,,,,"color slides",,"Hong Kong, China",,,,,,,,,"Virginia Polytechnic Institute and State University. University Libraries^^Virginia Polytechnic Institute and State University. University Libraries. Special Collections Department (Repository)","Estate of Leonard J. Currie","Hong Kong Harbor","Chinese^^landscapes (environments)^^waterways^^urban areas^^harbors^^Leonard J. Currie Slides^^Asia^^China",,"Currie, Leonard J. (Leonard James), 1913-1996 (Photographer)",,,,,http://rightsstatements.org/vocab/InC-EDU/1.0/,"Virginia Tech Libraries Special Collections^^http://aspace.lib.vt.edu/repositories/2/resources/2315",,,Image,LJC_135_007,,,,,,,,,,,,,,,,,,,,,,,,,,,,,,,,,,,,"Asia,China,Chinese,Currie - Leonard J,harbors,landscapes (environments),Leonard J. Currie Slides,urban areas,waterways",https://di.lib.vt.edu/files/original/Leonard_J._Currie_s_Slides_Collection/LJC_135_007/LJC_135_007.jpg,,Asia,1,0
1021,https://di.lib.vt.edu/items/show/1021,,,,,"1972-09 (photo taken)",,,,,,,,,,,,,,"Leonard J. Currie Slides",,,,,,,,,"color slides",,"Hong Kong, China",,,,,,,,,"Virginia Polytechnic Institute and State University. University Libraries^^Virginia Polytechnic Institute and State University. University Libraries. Special Collections Department (Repository)","Estate of Leonard J. Currie","Hong Kong Harbor","Chinese^^landscapes (environments)^^waterways^^urban areas^^harbors^^Leonard J. Currie Slides^^Asia^^China",,"Currie, Leonard J. (Leonard James), 1913-1996 (Photographer)",,,,,http://rightsstatements.org/vocab/InC-EDU/1.0/,"Virginia Tech Libraries Special Collections^^http://aspace.lib.vt.edu/repositories/2/resources/2315",,,Image,LJC_135_008,,,,,,,,,,,,,,,,,,,,,,,,,,,,,,,,,,,,"Asia,China,Chinese,Currie - Leonard J,harbors,landscapes (environments),Leonard J. Currie Slides,urban areas,waterways",https://di.lib.vt.edu/files/original/Leonard_J._Currie_s_Slides_Collection/LJC_135_008/LJC_135_008.jpg,,Asia,1,0
1022,https://di.lib.vt.edu/items/show/1022,,,,,"1990-05 (photo taken)",,,,,,,,,,,,,,"Leonard J. Currie Slides",,,,,,,,,"color slides",,Turkey,,,,,,,,,"Virginia Polytechnic Institute and State University. University Libraries^^Virginia Polytechnic Institute and State University. University Libraries. Special Collections Department (Repository)","Estate of Leonard J. Currie","Photo from boat going to Istanbul","Turkish^^watercraft^^waterways^^straits^^Leonard J. Currie Slides^^Asia^^Turkey",,"Currie, Leonard J. (Leonard James), 1913-1996 (Photographer)",,,,,http://rightsstatements.org/vocab/InC-EDU/1.0/,"Virginia Tech Libraries Special Collections^^http://aspace.lib.vt.edu/repositories/2/resources/2315",,,Image,LJC_121_001,,,,,,,,,,,,,,,,,,,,,,,,,,,,,,,,,,,,"Asia,Currie - Leonard J,Leonard J. Currie Slides,straits,Turkey,Turkish,watercraft,waterways",https://di.lib.vt.edu/files/original/Leonard_J._Currie_s_Slides_Collection/LJC_121_001/LJC_121_001.jpg,,Asia,1,0
1023,https://di.lib.vt.edu/items/show/1023,,,,,"1990-05 (photo taken)",,,,,,,,,,,,,,"Leonard J. Currie Slides",,,,,,,,,"color slides",,Turkey,,,,,,,,,"Virginia Polytechnic Institute and State University. University Libraries^^Virginia Polytechnic Institute and State University. University Libraries. Special Collections Department (Repository)","Estate of Leonard J. Currie","Photo from boat going to Istanbul","Turkish^^watercraft^^waterways^^straits^^Leonard J. Currie Slides^^Asia^^Turkey",,"Currie, Leonard J. (Leonard James), 1913-1996 (Photographer)",,,,,http://rightsstatements.org/vocab/InC-EDU/1.0/,"Virginia Tech Libraries Special Collections^^http://aspace.lib.vt.edu/repositories/2/resources/2315",,,Image,LJC_121_002,,,,,,,,,,,,,,,,,,,,,,,,,,,,,,,,,,,,"Asia,Currie - Leonard J,Leonard J. Currie Slides,straits,Turkey,Turkish,watercraft,waterways",https://di.lib.vt.edu/files/original/Leonard_J._Currie_s_Slides_Collection/LJC_121_002/LJC_121_002.jpg,,Asia,1,0
1024,https://di.lib.vt.edu/items/show/1024,,,,,"1990-05 (photo taken)",,,,,,,,,,,,,,"Leonard J. Currie Slides",,,,,,,,,"color slides",,Turkey,,,,,,,,,"Virginia Polytechnic Institute and State University. University Libraries^^Virginia Polytechnic Institute and State University. University Libraries. Special Collections Department (Repository)","Estate of Leonard J. Currie","Photo from boat going to Istanbul","Turkish^^watercraft^^waterways^^straits^^Leonard J. Currie Slides^^Asia^^Turkey",,"Currie, Leonard J. (Leonard James), 1913-1996 (Photographer)",,,,,http://rightsstatements.org/vocab/InC-EDU/1.0/,"Virginia Tech Libraries Special Collections^^http://aspace.lib.vt.edu/repositories/2/resources/2315",,,Image,LJC_121_003,,,,,,,,,,,,,,,,,,,,,,,,,,,,,,,,,,,,"Asia,Currie - Leonard J,Leonard J. Currie Slides,straits,Turkey,Turkish,watercraft,waterways",https://di.lib.vt.edu/files/original/Leonard_J._Currie_s_Slides_Collection/LJC_121_003/LJC_121_003.jpg,,Asia,1,0
1026,https://di.lib.vt.edu/items/show/1026,,,,,"1990-05 (photo taken)",,,,,,,,,,,,,,"Leonard J. Currie Slides",,,,,,,,,"color slides",,Turkey,,,,,,,,,"Virginia Polytechnic Institute and State University. University Libraries^^Virginia Polytechnic Institute and State University. University Libraries. Special Collections Department (Repository)","Estate of Leonard J. Currie","Photo from boat going to Istanbul","Turkish^^watercraft^^waterways^^harbors^^landscape gardening^^straits^^Leonard J. Currie Slides^^Asia^^Turkey",,"Currie, Leonard J. (Leonard James), 1913-1996 (Photographer)",,,,,http://rightsstatements.org/vocab/InC-EDU/1.0/,"Virginia Tech Libraries Special Collections^^http://aspace.lib.vt.edu/repositories/2/resources/2315",,,Image,LJC_121_005,,,,,,,,,,,,,,,,,,,,,,,,,,,,,,,,,,,,"Asia,Currie - Leonard J,harbors,landscape gardening,Leonard J. Currie Slides,straits,Turkey,Turkish,watercraft,waterways",https://di.lib.vt.edu/files/original/Leonard_J._Currie_s_Slides_Collection/LJC_121_005/LJC_121_005.jpg,,Asia,1,0
1028,https://di.lib.vt.edu/items/show/1028,,,,,"1990-05 (photo taken)",,,,,,,,,,,,,,"Leonard J. Currie Slides",,,,,,,,,"color slides",,Turkey,,,,,,,,,"Virginia Polytechnic Institute and State University. University Libraries^^Virginia Polytechnic Institute and State University. University Libraries. Special Collections Department (Repository)","Estate of Leonard J. Currie","Photo from boat going to Istanbul","Turkish^^watercraft^^waterways^^straits^^Leonard J. Currie Slides^^Asia^^Turkey",,"Currie, Leonard J. (Leonard James), 1913-1996 (Photographer)",,,,,http://rightsstatements.org/vocab/InC-EDU/1.0/,"Virginia Tech Libraries Special Collections^^http://aspace.lib.vt.edu/repositories/2/resources/2315",,,Image,LJC_121_007,,,,,,,,,,,,,,,,,,,,,,,,,,,,,,,,,,,,"Asia,Currie - Leonard J,Leonard J. Currie Slides,straits,Turkey,Turkish,watercraft,waterways",https://di.lib.vt.edu/files/original/Leonard_J._Currie_s_Slides_Collection/LJC_121_007/LJC_121_007.jpg,,Asia,1,0
1029,https://di.lib.vt.edu/items/show/1029,,,,,"1990-05 (photo taken)",,,,,,,,,,,,,,"Leonard J. Currie Slides",,,,,,,,,"color slides",,Turkey,,,,,,,,,"Virginia Polytechnic Institute and State University. University Libraries^^Virginia Polytechnic Institute and State University. University Libraries. Special Collections Department (Repository)","Estate of Leonard J. Currie","Photo from boat going to Istanbul","Turkish^^watercraft^^waterways^^straits^^Leonard J. Currie Slides^^Asia^^Turkey",,"Currie, Leonard J. (Leonard James), 1913-1996 (Photographer)",,,,,http://rightsstatements.org/vocab/InC-EDU/1.0/,"Virginia Tech Libraries Special Collections^^http://aspace.lib.vt.edu/repositories/2/resources/2315",,,Image,LJC_121_008,,,,,,,,,,,,,,,,,,,,,,,,,,,,,,,,,,,,"Asia,Currie - Leonard J,Leonard J. Currie Slides,straits,Turkey,Turkish,watercraft,waterways",https://di.lib.vt.edu/files/original/Leonard_J._Currie_s_Slides_Collection/LJC_121_008/LJC_121_008.jpg,,Asia,1,0
